{"text_format":"1","workbook":"xlsx","n_sheets":6,"sheets":["dashboard","data","control","calcs","charts","map icon"],"not_rendered":{"charts":4,"images":4,"macros":1,"external_links":0,"defined_names":37,"comments":0,"pivot_tables":0},"unopened":[],"bounds":{"document_bytes":16777216,"sheet_cells":100000,"rows_first":2000,"rows_last":500,"rows_between":2000,"halvings":0,"cell_chars":16384,"cell_head_chars":4096},"cells_cut":0,"cells_raw":0,"read":"whole","date_system":"1900"}

{"sheet":"dashboard","index":0,"n_rows":37,"n_cols":30,"rows_kept":37,"cut":false,"hidden":false,"merged":[]}
[]
[null,"European Union Unemployment Rates 2010 - 2024",null,null,null,null,null,null,null,null,"Percentage of population in the labour force",null,null,null,null,null,null,null,null,null,null,null,null,null,null,null,null,null,"www.clearlyandsimply.com"]
[]
[null,"Selected Country",null,null,null,null,null,null,"Selected Year",null,null,null,null,"Selected Gender",null,null,null,"Selected Age Class",null,"Choropleth Map",{"$f":"myCurrentYear","v":2023},null,null,null,null,null,null,null,"Selection / Filter of Dimensions"]
[null,{"$f":"myCurrentCountry","v":"Italy"},null,null,null,null,null,null,{"$f":"myCurrentYear","v":2023},null,null,null,null,{"$f":"myCurrentGender","v":"Total"},null,null,null,{"$f":"myCurrentAgeClass","v":"15 to 29 years"},null,"click on a country to select",null,null,null,null,null,null,null,null,"Country","Year"]
[null,"Scrollable Cross Table by Country and Year",null,null,null,null,null,null,null,null,null,null,null,null,"Sorted Bar Chart by Country",null,null,{"$f":"myCurrentYear","v":2023}]
[null,"click on a country (row header) or year (column header) to select",null,null,null,null,null,null,null,null,null,null,null,null,null,"click on a country to select"]
[null,null,{"$f":"_xlfn.ANCHORARRAY(calcs!D135)","v":2015},2016,2017,2018,2019,2020,2021,2022,2023,2024,null,null,{"$f":"_xlfn.ANCHORARRAY(calcs!B47)","v":1},{"$f":"_xlfn.ANCHORARRAY(calcs!G47)","v":"Greece"},{"$f":"_xlfn.ANCHORARRAY(calcs!H47)","v":0.218}]
[null,{"$f":"_xlfn.ANCHORARRAY(calcs!C136)","v":"Germany"},{"$f":"_xlfn.ANCHORARRAY(calcs!D136)","v":6.9000000000000006E-2},6.5000000000000002E-2,6.2E-2,5.7000000000000002E-2,5.2000000000000005E-2,6.7000000000000004E-2,0.06,0.05,0.05,5.5E-2,null,null,2,"Spain",0.214]
[null,"Greece",0.41299999999999998,0.38799999999999996,0.36099999999999999,0.33,0.29799999999999999,0.317,0.28399999999999997,0.24299999999999999,0.218,0.191,null,null,3,"Italy",0.16699999999999998]
[null,"Hungary",0.11800000000000001,8.8000000000000009E-2,7.0000000000000007E-2,6.4000000000000001E-2,7.0999999999999994E-2,8.4000000000000005E-2,8.199999999999999E-2,6.7000000000000004E-2,0.08,9.1999999999999998E-2,null,null,4,"Sweden",0.16]
[null,"Ireland",0.16600000000000001,0.13900000000000001,0.115,0.106,9.6000000000000002E-2,0.122,0.11199999999999999,8.3000000000000004E-2,8.5999999999999993E-2,8.5999999999999993E-2,null,null,5,"Portugal",0.14199999999999999,null,null,null,null,null,null,null,null,null,"not EU"]
[null,"Italy",0.3,0.28499999999999998,0.26700000000000002,0.248,0.22399999999999998,0.22500000000000001,0.223,0.18,0.16699999999999998,0.14699999999999999,null,null,6,"France",0.13600000000000001,null,null,null,null,null,null,null,null,{"$f":"IF(AA13=calcs!$D$182,\"t\",\"\")","v":""},{"$f":"control!E91","v":"no data"}]
[null,"Latvia",0.129,0.13400000000000001,0.11599999999999999,0.106,9.3000000000000013E-2,0.13200000000000001,0.11199999999999999,0.111,9.5000000000000001E-2,0.11199999999999999,null,null,7,"Croatia",0.13,null,null,null,null,null,null,null,null,{"$f":"IF(AA14=calcs!$D$182,\"t\",\"\")","v":""},{"$f":"control!E92","v":"0% to 2%"}]
[null,"Lithuania",0.127,0.10400000000000001,8.5999999999999993E-2,7.4999999999999997E-2,8.6999999999999994E-2,0.13400000000000001,0.1,8.3000000000000004E-2,9.8000000000000004E-2,0.115,null,null,8,"Romania",0.13,null,null,null,null,null,null,null,null,{"$f":"IF(AA15=calcs!$D$182,\"t\",\"\")","v":""},{"$f":"control!E93","v":"2% to 4%"}]
[null,"Luxembourg",0.11900000000000001,0.106,9.4E-2,0.10099999999999999,0.10800000000000001,0.13300000000000001,9.9000000000000005E-2,0.09,0.10400000000000001,0.13,null,null,9,"Finland",0.127,null,null,null,null,null,null,null,null,{"$f":"IF(AA16=calcs!$D$182,\"t\",\"\")","v":""},{"$f":"control!E94","v":"4% to 6%"}]
[null,"Malta",8.5999999999999993E-2,7.400000000000001E-2,7.2999999999999995E-2,5.5999999999999994E-2,6.9000000000000006E-2,7.8E-2,7.0000000000000007E-2,6.7000000000000004E-2,6.4000000000000001E-2,0.06,null,null,10,"Cyprus",0.11800000000000001,null,null,null,null,null,null,null,null,{"$f":"IF(AA17=calcs!$D$182,\"t\",\"\")","v":""},{"$f":"control!E95","v":"6% to 8%"}]
[null,"Netherlands",0.106,0.1,8.5000000000000006E-2,7.0999999999999994E-2,7.0999999999999994E-2,8.900000000000001E-2,7.2999999999999995E-2,6.3E-2,6.7000000000000004E-2,7.0000000000000007E-2,null,null,11,"Belgium",0.11599999999999999,null,null,null,null,null,null,null,null,{"$f":"IF(AA18=calcs!$D$182,\"t\",\"\")","v":""},{"$f":"control!E96","v":"8% to 10%"}]
[null,null,null,null,null,null,null,null,null,null,null,null,null,null,12,"Estonia",0.11599999999999999,null,null,null,null,null,null,null,null,{"$f":"IF(AA19=calcs!$D$182,\"t\",\"\")","v":""},{"$f":"control!E97","v":"10% to 12%"}]
[null,null,null,null,null,null,null,null,null,null,null,null,null,null,13,"Slovakia",0.11599999999999999,null,null,null,null,null,null,null,null,{"$f":"IF(AA20=calcs!$D$182,\"t\",\"\")","v":""},{"$f":"control!E98","v":"12% to 14%"},null,null,"Age Class"]
[null,"Band or Line Chart (range of all countries, selected country and average over time)",null,null,null,null,null,null,null,null,null,null,null,null,14,"Luxembourg",0.10400000000000001,null,null,null,null,null,null,null,null,{"$f":"IF(AA21=calcs!$D$182,\"t\",\"\")","v":""},{"$f":"control!E99","v":"14% to 16%"}]
[null,null,null,"Band Chart",null,null,null,"Line Chart",null,null,null,null,null,null,15,"Denmark",0.10099999999999999,null,null,null,null,null,null,null,null,{"$f":"IF(AA22=calcs!$D$182,\"t\",\"\")","v":"t"},{"$f":"control!E100","v":"16% to 18%"}]
[null,null,null,null,null,null,null,null,null,null,null,null,null,null,16,"Lithuania",9.8000000000000004E-2,null,null,null,null,null,null,null,null,{"$f":"IF(AA23=calcs!$D$182,\"t\",\"\")","v":""},{"$f":"control!E101","v":"18% or more"}]
[null,null,null,null,null,null,null,null,null,null,null,null,null,null,17,"Latvia",9.5000000000000001E-2]
[null,null,null,null,null,null,null,null,null,null,null,null,null,null,18,"Ireland",8.5999999999999993E-2,null,null,"Dot Plot by Age Class",{"$f":"myCurrentYear","v":2023}]
[null,null,null,null,null,null,null,null,null,null,null,null,null,null,19,"Austria",8.199999999999999E-2,null,null,"click on an age class to select / filter by"]
[null,null,null,null,null,null,null,null,null,null,null,null,null,null,20,"Bulgaria",0.08]
[null,null,null,null,null,null,null,null,null,null,null,null,null,null,21,"Hungary",0.08,null,null,{"$f":"_xlfn.ANCHORARRAY(calcs!C78)","v":"15 to 24 years"}]
[null,null,null,null,null,null,null,null,null,null,null,null,null,null,22,"Slovenia",7.4999999999999997E-2,null,null,"15 to 29 years",null,null,null,null,null,null,null,null,null,"Gender"]
[null,null,null,null,null,null,null,null,null,null,null,null,null,null,23,"Netherlands",6.7000000000000004E-2,null,null,"15 to 74 years"]
[null,null,null,null,null,null,null,null,null,null,null,null,null,null,24,"Poland",6.7000000000000004E-2,null,null,"20 to 64 years"]
[null,null,null,null,null,null,null,null,null,null,null,null,null,null,25,"Malta",6.4000000000000001E-2,null,null,"25 to 54 years"]
[null,null,null,null,null,null,null,null,null,null,null,null,null,null,26,"Czechia",5.2000000000000005E-2,null,null,"25 to 74 years"]
[null,null,null,null,null,null,null,null,null,null,null,null,null,null,27,"Germany",0.05,null,null,"55 to 74 years",null,null,null,null,null,null,null,null,"Color scheme of the map"]
[]
[null,null,null,null,null,null,null,null,null,null,null,null,null,null,null,null,null,{"$f":"\"Average (unweighted) \"&TEXT(calcs!$L$47,\"0%\")","v":"Average (unweighted) 11%"}]
[null,"Last row",null,null,null,null,null,null,null,null,null,null,null,null,null,null,null,null,null,null,null,null,null,null,null,null,null,null,null,"End of worksheet"]

{"sheet":"data","index":1,"n_rows":8525,"n_cols":6,"rows_kept":8525,"cut":false,"hidden":false,"merged":[]}
[]
[null,"Data"]
[]
[null,"Data Source"]
[]
[null,"EuroStat","http://ec.europa.eu/eurostat/en"]
[null,null,"https://ec.europa.eu/eurostat/databrowser/view/une_rt_a__custom_17190564/default/table?lang=en"]
[null,"Last update of data: ","12/06/2025 23:00"]
[null,"Dataset","Unemployment by gender and age - annual data [une_rt_a__custom_17190516]"]
[null,"Last updated","12/06/2025 23:00"]
[null,"Unit of measure","Percentage of population in the labour force"]
[null,"Time frequency","Annual"]
[]
[null,"Data"]
[]
[null,null,null,null,null,"Empty cells = no data available"]
[]
[null,"Country","Gender","Age_Class","Year","Unemployment_Rate"]
[null,"Austria","Total","15 to 24 years",2010,0.10099999999999999]
[null,"Austria","Total","15 to 24 years",2011,9.5000000000000001E-2]
[null,"Austria","Total","15 to 24 years",2012,0.1]
[null,"Austria","Total","15 to 24 years",2013,0.10300000000000001]
[null,"Austria","Total","15 to 24 years",2014,0.11]
[null,"Austria","Total","15 to 24 years",2015,0.113]
[null,"Austria","Total","15 to 24 years",2016,0.12]
[null,"Austria","Total","15 to 24 years",2017,0.105]
[null,"Austria","Total","15 to 24 years",2018,0.1]
[null,"Austria","Total","15 to 24 years",2019,9.0999999999999998E-2]
[null,"Austria","Total","15 to 24 years",2020,0.11699999999999999]
[null,"Austria","Total","15 to 24 years",2021,0.11]
[null,"Austria","Total","15 to 24 years",2022,9.5000000000000001E-2]
[null,"Austria","Total","15 to 24 years",2023,0.10400000000000001]
[null,"Austria","Total","15 to 24 years",2024,0.10300000000000001]
[null,"Belgium","Total","15 to 24 years",2010,0.22399999999999998]
[null,"Belgium","Total","15 to 24 years",2011,0.18899999999999997]
[null,"Belgium","Total","15 to 24 years",2012,0.2]
[null,"Belgium","Total","15 to 24 years",2013,0.23899999999999999]
[null,"Belgium","Total","15 to 24 years",2014,0.23399999999999999]
[null,"Belgium","Total","15 to 24 years",2015,0.22500000000000001]
[null,"Belgium","Total","15 to 24 years",2016,0.20300000000000001]
[null,"Belgium","Total","15 to 24 years",2017,0.19399999999999998]
[null,"Belgium","Total","15 to 24 years",2018,0.16]
[null,"Belgium","Total","15 to 24 years",2019,0.14499999999999999]
[null,"Belgium","Total","15 to 24 years",2020,0.159]
[null,"Belgium","Total","15 to 24 years",2021,0.182]
[null,"Belgium","Total","15 to 24 years",2022,0.16399999999999998]
[null,"Belgium","Total","15 to 24 years",2023,0.161]
[null,"Belgium","Total","15 to 24 years",2024,0.17399999999999999]
[null,"Bulgaria","Total","15 to 24 years",2010,0.251]
[null,"Bulgaria","Total","15 to 24 years",2011,0.28199999999999997]
[null,"Bulgaria","Total","15 to 24 years",2012,0.312]
[null,"Bulgaria","Total","15 to 24 years",2013,0.315]
[null,"Bulgaria","Total","15 to 24 years",2014,0.26899999999999996]
[null,"Bulgaria","Total","15 to 24 years",2015,0.247]
[null,"Bulgaria","Total","15 to 24 years",2016,0.20399999999999999]
[null,"Bulgaria","Total","15 to 24 years",2017,0.161]
[null,"Bulgaria","Total","15 to 24 years",2018,0.159]
[null,"Bulgaria","Total","15 to 24 years",2019,0.121]
[null,"Bulgaria","Total","15 to 24 years",2020,0.17499999999999999]
[null,"Bulgaria","Total","15 to 24 years",2021,0.158]
[null,"Bulgaria","Total","15 to 24 years",2022,0.106]
[null,"Bulgaria","Total","15 to 24 years",2023,0.121]
[null,"Bulgaria","Total","15 to 24 years",2024,0.12300000000000001]
[null,"Croatia","Total","15 to 24 years",2010,0.32400000000000001]
[null,"Croatia","Total","15 to 24 years",2011,0.36700000000000005]
[null,"Croatia","Total","15 to 24 years",2012,0.42499999999999999]
[null,"Croatia","Total","15 to 24 years",2013,0.505]
[null,"Croatia","Total","15 to 24 years",2014,0.45700000000000002]
[null,"Croatia","Total","15 to 24 years",2015,0.42299999999999999]
[null,"Croatia","Total","15 to 24 years",2016,0.309]
[null,"Croatia","Total","15 to 24 years",2017,0.27399999999999997]
[null,"Croatia","Total","15 to 24 years",2018,0.23499999999999999]
[null,"Croatia","Total","15 to 24 years",2019,0.16699999999999998]
[null,"Croatia","Total","15 to 24 years",2020,0.20600000000000002]
[null,"Croatia","Total","15 to 24 years",2021,0.215]
[null,"Croatia","Total","15 to 24 years",2022,0.17699999999999999]
[null,"Croatia","Total","15 to 24 years",2023,0.18899999999999997]
[null,"Croatia","Total","15 to 24 years",2024,0.16800000000000001]
[null,"Cyprus","Total","15 to 24 years",2010,0.16600000000000001]
[null,"Cyprus","Total","15 to 24 years",2011,0.22399999999999998]
[null,"Cyprus","Total","15 to 24 years",2012,0.27699999999999997]
[null,"Cyprus","Total","15 to 24 years",2013,0.38900000000000001]
[null,"Cyprus","Total","15 to 24 years",2014,0.36]
[null,"Cyprus","Total","15 to 24 years",2015,0.32799999999999996]
[null,"Cyprus","Total","15 to 24 years",2016,0.29100000000000004]
[null,"Cyprus","Total","15 to 24 years",2017,0.247]
[null,"Cyprus","Total","15 to 24 years",2018,0.20199999999999999]
[null,"Cyprus","Total","15 to 24 years",2019,0.17600000000000002]
[null,"Cyprus","Total","15 to 24 years",2020,0.17600000000000002]
[null,"Cyprus","Total","15 to 24 years",2021,0.17300000000000001]
[null,"Cyprus","Total","15 to 24 years",2022,0.18100000000000002]
[null,"Cyprus","Total","15 to 24 years",2023,0.16600000000000001]
[null,"Cyprus","Total","15 to 24 years",2024,0.13]
[null,"Czechia","Total","15 to 24 years",2010,0.183]
[null,"Czechia","Total","15 to 24 years",2011,0.18100000000000002]
[null,"Czechia","Total","15 to 24 years",2012,0.19500000000000001]
[null,"Czechia","Total","15 to 24 years",2013,0.19]
[null,"Czechia","Total","15 to 24 years",2014,0.159]
[null,"Czechia","Total","15 to 24 years",2015,0.126]
[null,"Czechia","Total","15 to 24 years",2016,0.105]
[null,"Czechia","Total","15 to 24 years",2017,7.9000000000000001E-2]
[null,"Czechia","Total","15 to 24 years",2018,6.7000000000000004E-2]
[null,"Czechia","Total","15 to 24 years",2019,5.5999999999999994E-2]
[null,"Czechia","Total","15 to 24 years",2020,0.08]
[null,"Czechia","Total","15 to 24 years",2021,8.199999999999999E-2]
[null,"Czechia","Total","15 to 24 years",2022,6.8000000000000005E-2]
[null,"Czechia","Total","15 to 24 years",2023,8.3000000000000004E-2]
[null,"Czechia","Total","15 to 24 years",2024,9.0999999999999998E-2]
[null,"Denmark","Total","15 to 24 years",2010,0.156]
[null,"Denmark","Total","15 to 24 years",2011,0.16399999999999998]
[null,"Denmark","Total","15 to 24 years",2012,0.158]
[null,"Denmark","Total","15 to 24 years",2013,0.14800000000000002]
[null,"Denmark","Total","15 to 24 years",2014,0.14199999999999999]
[null,"Denmark","Total","15 to 24 years",2015,0.122]
[null,"Denmark","Total","15 to 24 years",2016,0.122]
[null,"Denmark","Total","15 to 24 years",2017,0.124]
[null,"Denmark","Total","15 to 24 years",2018,0.105]
[null,"Denmark","Total","15 to 24 years",2019,0.10099999999999999]
[null,"Denmark","Total","15 to 24 years",2020,0.11699999999999999]
[null,"Denmark","Total","15 to 24 years",2021,0.10800000000000001]
[null,"Denmark","Total","15 to 24 years",2022,0.106]
[null,"Denmark","Total","15 to 24 years",2023,0.115]
[null,"Denmark","Total","15 to 24 years",2024,0.14599999999999999]
[null,"Estonia","Total","15 to 24 years",2010,0.32600000000000001]
[null,"Estonia","Total","15 to 24 years",2011,0.223]
[null,"Estonia","Total","15 to 24 years",2012,0.20699999999999999]
[null,"Estonia","Total","15 to 24 years",2013,0.18600000000000003]
[null,"Estonia","Total","15 to 24 years",2014,0.14899999999999999]
[null,"Estonia","Total","15 to 24 years",2015,0.14300000000000002]
[null,"Estonia","Total","15 to 24 years",2016,0.14000000000000001]
[null,"Estonia","Total","15 to 24 years",2017,0.121]
[null,"Estonia","Total","15 to 24 years",2018,0.12]
[null,"Estonia","Total","15 to 24 years",2019,0.11599999999999999]
[null,"Estonia","Total","15 to 24 years",2020,0.183]
[null,"Estonia","Total","15 to 24 years",2021,0.16699999999999998]
[null,"Estonia","Total","15 to 24 years",2022,0.18600000000000003]
[null,"Estonia","Total","15 to 24 years",2023,0.17300000000000001]
[null,"Estonia","Total","15 to 24 years",2024,0.191]
[null,"Finland","Total","15 to 24 years",2010,0.22]
[null,"Finland","Total","15 to 24 years",2011,0.20300000000000001]
[null,"Finland","Total","15 to 24 years",2012,0.19500000000000001]
[null,"Finland","Total","15 to 24 years",2013,0.20600000000000002]
[null,"Finland","Total","15 to 24 years",2014,0.20499999999999999]
[null,"Finland","Total","15 to 24 years",2015,0.22500000000000001]
[null,"Finland","Total","15 to 24 years",2016,0.20499999999999999]
[null,"Finland","Total","15 to 24 years",2017,0.2]
[null,"Finland","Total","15 to 24 years",2018,0.17300000000000001]
[null,"Finland","Total","15 to 24 years",2019,0.17699999999999999]
[null,"Finland","Total","15 to 24 years",2020,0.21]
[null,"Finland","Total","15 to 24 years",2021,0.17100000000000001]
[null,"Finland","Total","15 to 24 years",2022,0.14199999999999999]
[null,"Finland","Total","15 to 24 years",2023,0.16200000000000001]
[null,"Finland","Total","15 to 24 years",2024,0.188]
[null,"France","Total","15 to 24 years",2010,0.247]
[null,"France","Total","15 to 24 years",2011,0.24100000000000002]
[null,"France","Total","15 to 24 years",2012,0.25800000000000001]
[null,"France","Total","15 to 24 years",2013,0.26400000000000001]
[null,"France","Total","15 to 24 years",2014,0.25700000000000001]
[null,"France","Total","15 to 24 years",2015,0.26100000000000001]
[null,"France","Total","15 to 24 years",2016,0.26]
[null,"France","Total","15 to 24 years",2017,0.23499999999999999]
[null,"France","Total","15 to 24 years",2018,0.22]
[null,"France","Total","15 to 24 years",2019,0.20699999999999999]
[null,"France","Total","15 to 24 years",2020,0.215]
[null,"France","Total","15 to 24 years",2021,0.18899999999999997]
[null,"France","Total","15 to 24 years",2022,0.17300000000000001]
[null,"France","Total","15 to 24 years",2023,0.17199999999999999]
[null,"France","Total","15 to 24 years",2024,0.187]
[null,"Germany","Total","15 to 24 years",2010,0.105]
[null,"Germany","Total","15 to 24 years",2011,9.0999999999999998E-2]
[null,"Germany","Total","15 to 24 years",2012,8.5999999999999993E-2]
[null,"Germany","Total","15 to 24 years",2013,8.3000000000000004E-2]
[null,"Germany","Total","15 to 24 years",2014,8.199999999999999E-2]
[null,"Germany","Total","15 to 24 years",2015,7.6999999999999999E-2]
[null,"Germany","Total","15 to 24 years",2016,7.4999999999999997E-2]
[null,"Germany","Total","15 to 24 years",2017,7.2000000000000008E-2]
[null,"Germany","Total","15 to 24 years",2018,6.6000000000000003E-2]
[null,"Germany","Total","15 to 24 years",2019,6.0999999999999999E-2]
[null,"Germany","Total","15 to 24 years",2020,7.9000000000000001E-2]
[null,"Germany","Total","15 to 24 years",2021,7.0000000000000007E-2]
[null,"Germany","Total","15 to 24 years",2022,0.06]
[null,"Germany","Total","15 to 24 years",2023,5.9000000000000004E-2]
[null,"Germany","Total","15 to 24 years",2024,6.5000000000000002E-2]
[null,"Greece","Total","15 to 24 years",2010,0.33600000000000002]
[null,"Greece","Total","15 to 24 years",2011,0.45200000000000001]
[null,"Greece","Total","15 to 24 years",2012,0.55899999999999994]
[null,"Greece","Total","15 to 24 years",2013,0.59200000000000008]
[null,"Greece","Total","15 to 24 years",2014,0.53]
[null,"Greece","Total","15 to 24 years",2015,0.503]
[null,"Greece","Total","15 to 24 years",2016,0.48200000000000004]
[null,"Greece","Total","15 to 24 years",2017,0.44500000000000001]
[null,"Greece","Total","15 to 24 years",2018,0.41200000000000003]
[null,"Greece","Total","15 to 24 years",2019,0.375]
[null,"Greece","Total","15 to 24 years",2020,0.38]
[null,"Greece","Total","15 to 24 years",2021,0.35499999999999998]
[null,"Greece","Total","15 to 24 years",2022,0.314]
[null,"Greece","Total","15 to 24 years",2023,0.26700000000000002]
[null,"Greece","Total","15 to 24 years",2024,0.22500000000000001]
[null,"Hungary","Total","15 to 24 years",2010,0.25900000000000001]
[null,"Hungary","Total","15 to 24 years",2011,0.254]
[null,"Hungary","Total","15 to 24 years",2012,0.27800000000000002]
[null,"Hungary","Total","15 to 24 years",2013,0.26100000000000001]
[null,"Hungary","Total","15 to 24 years",2014,0.20100000000000001]
[null,"Hungary","Total","15 to 24 years",2015,0.17100000000000001]
[null,"Hungary","Total","15 to 24 years",2016,0.127]
[null,"Hungary","Total","15 to 24 years",2017,0.105]
[null,"Hungary","Total","15 to 24 years",2018,9.9000000000000005E-2]
[null,"Hungary","Total","15 to 24 years",2019,0.114]
[null,"Hungary","Total","15 to 24 years",2020,0.127]
[null,"Hungary","Total","15 to 24 years",2021,0.13600000000000001]
[null,"Hungary","Total","15 to 24 years",2022,0.106]
[null,"Hungary","Total","15 to 24 years",2023,0.128]
[null,"Hungary","Total","15 to 24 years",2024,0.152]
[null,"Ireland","Total","15 to 24 years",2010,0.28100000000000003]
[null,"Ireland","Total","15 to 24 years",2011,0.29600000000000004]
[null,"Ireland","Total","15 to 24 years",2012,0.308]
[null,"Ireland","Total","15 to 24 years",2013,0.26700000000000002]
[null,"Ireland","Total","15 to 24 years",2014,0.23399999999999999]
[null,"Ireland","Total","15 to 24 years",2015,0.20199999999999999]
[null,"Ireland","Total","15 to 24 years",2016,0.16800000000000001]
[null,"Ireland","Total","15 to 24 years",2017,0.14400000000000002]
[null,"Ireland","Total","15 to 24 years",2018,0.13800000000000001]
[null,"Ireland","Total","15 to 24 years",2019,0.125]
[null,"Ireland","Total","15 to 24 years",2020,0.158]
[null,"Ireland","Total","15 to 24 years",2021,0.14599999999999999]
[null,"Ireland","Total","15 to 24 years",2022,0.10099999999999999]
[null,"Ireland","Total","15 to 24 years",2023,0.107]
[null,"Ireland","Total","15 to 24 years",2024,0.106]
[null,"Italy","Total","15 to 24 years",2010,0.28000000000000003]
[null,"Italy","Total","15 to 24 years",2011,0.29199999999999998]
[null,"Italy","Total","15 to 24 years",2012,0.35299999999999998]
[null,"Italy","Total","15 to 24 years",2013,0.4]
[null,"Italy","Total","15 to 24 years",2014,0.42700000000000005]
[null,"Italy","Total","15 to 24 years",2015,0.40299999999999997]
[null,"Italy","Total","15 to 24 years",2016,0.377]
[null,"Italy","Total","15 to 24 years",2017,0.34600000000000003]
[null,"Italy","Total","15 to 24 years",2018,0.32200000000000001]
[null,"Italy","Total","15 to 24 years",2019,0.29199999999999998]
[null,"Italy","Total","15 to 24 years",2020,0.29799999999999999]
[null,"Italy","Total","15 to 24 years",2021,0.29699999999999999]
[null,"Italy","Total","15 to 24 years",2022,0.23699999999999999]
[null,"Italy","Total","15 to 24 years",2023,0.22699999999999998]
[null,"Italy","Total","15 to 24 years",2024,0.20300000000000001]
[null,"Latvia","Total","15 to 24 years",2010,0.36200000000000004]
[null,"Latvia","Total","15 to 24 years",2011,0.31]
[null,"Latvia","Total","15 to 24 years",2012,0.28499999999999998]
[null,"Latvia","Total","15 to 24 years",2013,0.23199999999999998]
[null,"Latvia","Total","15 to 24 years",2014,0.19600000000000001]
[null,"Latvia","Total","15 to 24 years",2015,0.16300000000000001]
[null,"Latvia","Total","15 to 24 years",2016,0.17499999999999999]
[null,"Latvia","Total","15 to 24 years",2017,0.17]
[null,"Latvia","Total","15 to 24 years",2018,0.122]
[null,"Latvia","Total","15 to 24 years",2019,0.127]
[null,"Latvia","Total","15 to 24 years",2020,0.14899999999999999]
[null,"Latvia","Total","15 to 24 years",2021,0.14800000000000002]
[null,"Latvia","Total","15 to 24 years",2022,0.153]
[null,"Latvia","Total","15 to 24 years",2023,0.12300000000000001]
[null,"Latvia","Total","15 to 24 years",2024,0.13600000000000001]
[null,"Lithuania","Total","15 to 24 years",2010,0.35700000000000004]
[null,"Lithuania","Total","15 to 24 years",2011,0.32600000000000001]
[null,"Lithuania","Total","15 to 24 years",2012,0.26700000000000002]
[null,"Lithuania","Total","15 to 24 years",2013,0.21899999999999997]
[null,"Lithuania","Total","15 to 24 years",2014,0.193]
[null,"Lithuania","Total","15 to 24 years",2015,0.16300000000000001]
[null,"Lithuania","Total","15 to 24 years",2016,0.14499999999999999]
[null,"Lithuania","Total","15 to 24 years",2017,0.13300000000000001]
[null,"Lithuania","Total","15 to 24 years",2018,0.111]
[null,"Lithuania","Total","15 to 24 years",2019,0.11900000000000001]
[null,"Lithuania","Total","15 to 24 years",2020,0.19600000000000001]
[null,"Lithuania","Total","15 to 24 years",2021,0.14300000000000002]
[null,"Lithuania","Total","15 to 24 years",2022,0.11900000000000001]
[null,"Lithuania","Total","15 to 24 years",2023,0.13800000000000001]
[null,"Lithuania","Total","15 to 24 years",2024,0.16200000000000001]
[null,"Luxembourg","Total","15 to 24 years",2010,0.14199999999999999]
[null,"Luxembourg","Total","15 to 24 years",2011,0.16800000000000001]
[null,"Luxembourg","Total","15 to 24 years",2012,0.188]
[null,"Luxembourg","Total","15 to 24 years",2013,0.155]
[null,"Luxembourg","Total","15 to 24 years",2014,0.22600000000000001]
[null,"Luxembourg","Total","15 to 24 years",2015,0.17300000000000001]
[null,"Luxembourg","Total","15 to 24 years",2016,0.18899999999999997]
[null,"Luxembourg","Total","15 to 24 years",2017,0.154]
[null,"Luxembourg","Total","15 to 24 years",2018,0.14199999999999999]
[null,"Luxembourg","Total","15 to 24 years",2019,0.17]
[null,"Luxembourg","Total","15 to 24 years",2020,0.23199999999999998]
[null,"Luxembourg","Total","15 to 24 years",2021,0.16899999999999998]
[null,"Luxembourg","Total","15 to 24 years",2022,0.17600000000000002]
[null,"Luxembourg","Total","15 to 24 years",2023,0.188]
[null,"Luxembourg","Total","15 to 24 years",2024,0.21600000000000003]
[null,"Malta","Total","15 to 24 years",2010,0.13200000000000001]
[null,"Malta","Total","15 to 24 years",2011,0.13300000000000001]
[null,"Malta","Total","15 to 24 years",2012,0.13800000000000001]
[null,"Malta","Total","15 to 24 years",2013,0.127]
[null,"Malta","Total","15 to 24 years",2014,0.11699999999999999]
[null,"Malta","Total","15 to 24 years",2015,0.11599999999999999]
[null,"Malta","Total","15 to 24 years",2016,0.107]
[null,"Malta","Total","15 to 24 years",2017,0.106]
[null,"Malta","Total","15 to 24 years",2018,9.4E-2]
[null,"Malta","Total","15 to 24 years",2019,0.10099999999999999]
[null,"Malta","Total","15 to 24 years",2020,0.115]
[null,"Malta","Total","15 to 24 years",2021,9.9000000000000005E-2]
[null,"Malta","Total","15 to 24 years",2022,0.09]
[null,"Malta","Total","15 to 24 years",2023,9.1999999999999998E-2]
[null,"Malta","Total","15 to 24 years",2024,9.0999999999999998E-2]
[null,"Netherlands","Total","15 to 24 years",2010,0.124]
[null,"Netherlands","Total","15 to 24 years",2011,0.114]
[null,"Netherlands","Total","15 to 24 years",2012,0.129]
[null,"Netherlands","Total","15 to 24 years",2013,0.14199999999999999]
[null,"Netherlands","Total","15 to 24 years",2014,0.13800000000000001]
[null,"Netherlands","Total","15 to 24 years",2015,0.125]
[null,"Netherlands","Total","15 to 24 years",2016,0.121]
[null,"Netherlands","Total","15 to 24 years",2017,0.10400000000000001]
[null,"Netherlands","Total","15 to 24 years",2018,8.900000000000001E-2]
[null,"Netherlands","Total","15 to 24 years",2019,8.5000000000000006E-2]
[null,"Netherlands","Total","15 to 24 years",2020,0.106]
[null,"Netherlands","Total","15 to 24 years",2021,9.3000000000000013E-2]
[null,"Netherlands","Total","15 to 24 years",2022,7.5999999999999998E-2]
[null,"Netherlands","Total","15 to 24 years",2023,8.199999999999999E-2]
[null,"Netherlands","Total","15 to 24 years",2024,8.6999999999999994E-2]
[null,"Poland","Total","15 to 24 years",2010,0.24]
[null,"Poland","Total","15 to 24 years",2011,0.26]
[null,"Poland","Total","15 to 24 years",2012,0.26800000000000002]
[null,"Poland","Total","15 to 24 years",2013,0.27600000000000002]
[null,"Poland","Total","15 to 24 years",2014,0.24100000000000002]
[null,"Poland","Total","15 to 24 years",2015,0.21]
[null,"Poland","Total","15 to 24 years",2016,0.17800000000000002]
[null,"Poland","Total","15 to 24 years",2017,0.14899999999999999]
[null,"Poland","Total","15 to 24 years",2018,0.11800000000000001]
[null,"Poland","Total","15 to 24 years",2019,9.6999999999999989E-2]
[null,"Poland","Total","15 to 24 years",2020,0.10800000000000001]
[null,"Poland","Total","15 to 24 years",2021,0.11900000000000001]
[null,"Poland","Total","15 to 24 years",2022,0.10800000000000001]
[null,"Poland","Total","15 to 24 years",2023,0.114]
[null,"Poland","Total","15 to 24 years",2024,0.10800000000000001]
[null,"Portugal","Total","15 to 24 years",2010,0.28000000000000003]
[null,"Portugal","Total","15 to 24 years",2011,0.30399999999999999]
[null,"Portugal","Total","15 to 24 years",2012,0.38200000000000001]
[null,"Portugal","Total","15 to 24 years",2013,0.38600000000000001]
[null,"Portugal","Total","15 to 24 years",2014,0.34700000000000003]
[null,"Portugal","Total","15 to 24 years",2015,0.318]
[null,"Portugal","Total","15 to 24 years",2016,0.27800000000000002]
[null,"Portugal","Total","15 to 24 years",2017,0.23800000000000002]
[null,"Portugal","Total","15 to 24 years",2018,0.20199999999999999]
[null,"Portugal","Total","15 to 24 years",2019,0.184]
[null,"Portugal","Total","15 to 24 years",2020,0.22399999999999998]
[null,"Portugal","Total","15 to 24 years",2021,0.23399999999999999]
[null,"Portugal","Total","15 to 24 years",2022,0.192]
[null,"Portugal","Total","15 to 24 years",2023,0.20499999999999999]
[null,"Portugal","Total","15 to 24 years",2024,0.21600000000000003]
[null,"Romania","Total","15 to 24 years",2010,0.28000000000000003]
[null,"Romania","Total","15 to 24 years",2011,0.29399999999999998]
[null,"Romania","Total","15 to 24 years",2012,0.28199999999999997]
[null,"Romania","Total","15 to 24 years",2013,0.29600000000000004]
[null,"Romania","Total","15 to 24 years",2014,0.3]
[null,"Romania","Total","15 to 24 years",2015,0.27300000000000002]
[null,"Romania","Total","15 to 24 years",2016,0.25900000000000001]
[null,"Romania","Total","15 to 24 years",2017,0.23]
[null,"Romania","Total","15 to 24 years",2018,0.20499999999999999]
[null,"Romania","Total","15 to 24 years",2019,0.21]
[null,"Romania","Total","15 to 24 years",2020,0.21600000000000003]
[null,"Romania","Total","15 to 24 years",2021,0.21]
[null,"Romania","Total","15 to 24 years",2022,0.22800000000000001]
[null,"Romania","Total","15 to 24 years",2023,0.218]
[null,"Romania","Total","15 to 24 years",2024,0.23899999999999999]
[null,"Slovakia","Total","15 to 24 years",2010,0.34899999999999998]
[null,"Slovakia","Total","15 to 24 years",2011,0.34799999999999998]
[null,"Slovakia","Total","15 to 24 years",2012,0.35299999999999998]
[null,"Slovakia","Total","15 to 24 years",2013,0.34899999999999998]
[null,"Slovakia","Total","15 to 24 years",2014,0.31]
[null,"Slovakia","Total","15 to 24 years",2015,0.27699999999999997]
[null,"Slovakia","Total","15 to 24 years",2016,0.23399999999999999]
[null,"Slovakia","Total","15 to 24 years",2017,0.2]
[null,"Slovakia","Total","15 to 24 years",2018,0.158]
[null,"Slovakia","Total","15 to 24 years",2019,0.17100000000000001]
[null,"Slovakia","Total","15 to 24 years",2020,0.20399999999999999]
[null,"Slovakia","Total","15 to 24 years",2021,0.20600000000000002]
[null,"Slovakia","Total","15 to 24 years",2022,0.19899999999999998]
[null,"Slovakia","Total","15 to 24 years",2023,0.19800000000000001]
[null,"Slovakia","Total","15 to 24 years",2024,0.192]
[null,"Slovenia","Total","15 to 24 years",2010,0.14699999999999999]
[null,"Slovenia","Total","15 to 24 years",2011,0.159]
[null,"Slovenia","Total","15 to 24 years",2012,0.20800000000000002]
[null,"Slovenia","Total","15 to 24 years",2013,0.21600000000000003]
[null,"Slovenia","Total","15 to 24 years",2014,0.20499999999999999]
[null,"Slovenia","Total","15 to 24 years",2015,0.16399999999999998]
[null,"Slovenia","Total","15 to 24 years",2016,0.153]
[null,"Slovenia","Total","15 to 24 years",2017,0.113]
[null,"Slovenia","Total","15 to 24 years",2018,8.900000000000001E-2]
[null,"Slovenia","Total","15 to 24 years",2019,8.1000000000000003E-2]
[null,"Slovenia","Total","15 to 24 years",2020,0.14300000000000002]
[null,"Slovenia","Total","15 to 24 years",2021,0.128]
[null,"Slovenia","Total","15 to 24 years",2022,0.10099999999999999]
[null,"Slovenia","Total","15 to 24 years",2023,9.9000000000000005E-2]
[null,"Slovenia","Total","15 to 24 years",2024,0.109]
[null,"Spain","Total","15 to 24 years",2010,0.41499999999999998]
[null,"Spain","Total","15 to 24 years",2011,0.46200000000000002]
[null,"Spain","Total","15 to 24 years",2012,0.52900000000000003]
[null,"Spain","Total","15 to 24 years",2013,0.55500000000000005]
[null,"Spain","Total","15 to 24 years",2014,0.53200000000000003]
[null,"Spain","Total","15 to 24 years",2015,0.48299999999999998]
[null,"Spain","Total","15 to 24 years",2016,0.44400000000000001]
[null,"Spain","Total","15 to 24 years",2017,0.38600000000000001]
[null,"Spain","Total","15 to 24 years",2018,0.34299999999999997]
[null,"Spain","Total","15 to 24 years",2019,0.32500000000000001]
[null,"Spain","Total","15 to 24 years",2020,0.38299999999999995]
[null,"Spain","Total","15 to 24 years",2021,0.35]
[null,"Spain","Total","15 to 24 years",2022,0.29699999999999999]
[null,"Spain","Total","15 to 24 years",2023,0.28699999999999998]
[null,"Spain","Total","15 to 24 years",2024,0.26500000000000001]
[null,"Sweden","Total","15 to 24 years",2010,0.24100000000000002]
[null,"Sweden","Total","15 to 24 years",2011,0.221]
[null,"Sweden","Total","15 to 24 years",2012,0.22899999999999998]
[null,"Sweden","Total","15 to 24 years",2013,0.22800000000000001]
[null,"Sweden","Total","15 to 24 years",2014,0.222]
[null,"Sweden","Total","15 to 24 years",2015,0.19699999999999998]
[null,"Sweden","Total","15 to 24 years",2016,0.182]
[null,"Sweden","Total","15 to 24 years",2017,0.17100000000000001]
[null,"Sweden","Total","15 to 24 years",2018,0.16800000000000001]
[null,"Sweden","Total","15 to 24 years",2019,0.193]
[null,"Sweden","Total","15 to 24 years",2020,0.23600000000000002]
[null,"Sweden","Total","15 to 24 years",2021,0.247]
[null,"Sweden","Total","15 to 24 years",2022,0.217]
[null,"Sweden","Total","15 to 24 years",2023,0.221]
[null,"Sweden","Total","15 to 24 years",2024,0.24299999999999999]
[null,"Austria","Total","15 to 29 years",2010,8.6999999999999994E-2]
[null,"Austria","Total","15 to 29 years",2011,8.1000000000000003E-2]
[null,"Austria","Total","15 to 29 years",2012,8.5999999999999993E-2]
[null,"Austria","Total","15 to 29 years",2013,9.1999999999999998E-2]
[null,"Austria","Total","15 to 29 years",2014,9.5000000000000001E-2]
[null,"Austria","Total","15 to 29 years",2015,9.1999999999999998E-2]
[null,"Austria","Total","15 to 29 years",2016,9.8000000000000004E-2]
[null,"Austria","Total","15 to 29 years",2017,8.6999999999999994E-2]
[null,"Austria","Total","15 to 29 years",2018,0.08]
[null,"Austria","Total","15 to 29 years",2019,7.2999999999999995E-2]
[null,"Austria","Total","15 to 29 years",2020,9.5000000000000001E-2]
[null,"Austria","Total","15 to 29 years",2021,8.900000000000001E-2]
[null,"Austria","Total","15 to 29 years",2022,7.4999999999999997E-2]
[null,"Austria","Total","15 to 29 years",2023,8.199999999999999E-2]
[null,"Austria","Total","15 to 29 years",2024,8.199999999999999E-2]
[null,"Belgium","Total","15 to 29 years",2010,0.16200000000000001]
[null,"Belgium","Total","15 to 29 years",2011,0.13699999999999998]
[null,"Belgium","Total","15 to 29 years",2012,0.14800000000000002]
[null,"Belgium","Total","15 to 29 years",2013,0.16699999999999998]
[null,"Belgium","Total","15 to 29 years",2014,0.16600000000000001]
[null,"Belgium","Total","15 to 29 years",2015,0.159]
[null,"Belgium","Total","15 to 29 years",2016,0.14499999999999999]
[null,"Belgium","Total","15 to 29 years",2017,0.13600000000000001]
[null,"Belgium","Total","15 to 29 years",2018,0.11]
[null,"Belgium","Total","15 to 29 years",2019,0.1]
[null,"Belgium","Total","15 to 29 years",2020,0.11]
[null,"Belgium","Total","15 to 29 years",2021,0.122]
[null,"Belgium","Total","15 to 29 years",2022,0.114]
[null,"Belgium","Total","15 to 29 years",2023,0.11599999999999999]
[null,"Belgium","Total","15 to 29 years",2024,0.124]
[null,"Bulgaria","Total","15 to 29 years",2010,0.183]
[null,"Bulgaria","Total","15 to 29 years",2011,0.20699999999999999]
[null,"Bulgaria","Total","15 to 29 years",2012,0.22399999999999998]
[null,"Bulgaria","Total","15 to 29 years",2013,0.23300000000000001]
[null,"Bulgaria","Total","15 to 29 years",2014,0.192]
[null,"Bulgaria","Total","15 to 29 years",2015,0.16]
[null,"Bulgaria","Total","15 to 29 years",2016,0.13900000000000001]
[null,"Bulgaria","Total","15 to 29 years",2017,0.11599999999999999]
[null,"Bulgaria","Total","15 to 29 years",2018,9.9000000000000005E-2]
[null,"Bulgaria","Total","15 to 29 years",2019,8.6999999999999994E-2]
[null,"Bulgaria","Total","15 to 29 years",2020,0.107]
[null,"Bulgaria","Total","15 to 29 years",2021,0.10400000000000001]
[null,"Bulgaria","Total","15 to 29 years",2022,7.9000000000000001E-2]
[null,"Bulgaria","Total","15 to 29 years",2023,0.08]
[null,"Bulgaria","Total","15 to 29 years",2024,7.6999999999999999E-2]
[null,"Croatia","Total","15 to 29 years",2010,0.23499999999999999]
[null,"Croatia","Total","15 to 29 years",2011,0.28300000000000003]
[null,"Croatia","Total","15 to 29 years",2012,0.318]
[null,"Croatia","Total","15 to 29 years",2013,0.34]
[null,"Croatia","Total","15 to 29 years",2014,0.32400000000000001]
[null,"Croatia","Total","15 to 29 years",2015,0.29799999999999999]
[null,"Croatia","Total","15 to 29 years",2016,0.24399999999999999]
[null,"Croatia","Total","15 to 29 years",2017,0.218]
[null,"Croatia","Total","15 to 29 years",2018,0.17499999999999999]
[null,"Croatia","Total","15 to 29 years",2019,0.13400000000000001]
[null,"Croatia","Total","15 to 29 years",2020,0.16200000000000001]
[null,"Croatia","Total","15 to 29 years",2021,0.16300000000000001]
[null,"Croatia","Total","15 to 29 years",2022,0.13500000000000001]
[null,"Croatia","Total","15 to 29 years",2023,0.13]
[null,"Croatia","Total","15 to 29 years",2024,0.11900000000000001]
[null,"Cyprus","Total","15 to 29 years",2010,0.11900000000000001]
[null,"Cyprus","Total","15 to 29 years",2011,0.14800000000000002]
[null,"Cyprus","Total","15 to 29 years",2012,0.20399999999999999]
[null,"Cyprus","Total","15 to 29 years",2013,0.27500000000000002]
[null,"Cyprus","Total","15 to 29 years",2014,0.26200000000000001]
[null,"Cyprus","Total","15 to 29 years",2015,0.245]
[null,"Cyprus","Total","15 to 29 years",2016,0.218]
[null,"Cyprus","Total","15 to 29 years",2017,0.188]
[null,"Cyprus","Total","15 to 29 years",2018,0.14699999999999999]
[null,"Cyprus","Total","15 to 29 years",2019,0.121]
[null,"Cyprus","Total","15 to 29 years",2020,0.13100000000000001]
[null,"Cyprus","Total","15 to 29 years",2021,0.14000000000000001]
[null,"Cyprus","Total","15 to 29 years",2022,0.13500000000000001]
[null,"Cyprus","Total","15 to 29 years",2023,0.11800000000000001]
[null,"Cyprus","Total","15 to 29 years",2024,0.1]
[null,"Czechia","Total","15 to 29 years",2010,0.13]
[null,"Czechia","Total","15 to 29 years",2011,0.11800000000000001]
[null,"Czechia","Total","15 to 29 years",2012,0.13100000000000001]
[null,"Czechia","Total","15 to 29 years",2013,0.12300000000000001]
[null,"Czechia","Total","15 to 29 years",2014,0.107]
[null,"Czechia","Total","15 to 29 years",2015,0.09]
[null,"Czechia","Total","15 to 29 years",2016,7.400000000000001E-2]
[null,"Czechia","Total","15 to 29 years",2017,5.0999999999999997E-2]
[null,"Czechia","Total","15 to 29 years",2018,4.4000000000000004E-2]
[null,"Czechia","Total","15 to 29 years",2019,3.7000000000000005E-2]
[null,"Czechia","Total","15 to 29 years",2020,5.2999999999999999E-2]
[null,"Czechia","Total","15 to 29 years",2021,5.2000000000000005E-2]
[null,"Czechia","Total","15 to 29 years",2022,4.2000000000000003E-2]
[null,"Czechia","Total","15 to 29 years",2023,5.2000000000000005E-2]
[null,"Czechia","Total","15 to 29 years",2024,5.9000000000000004E-2]
[null,"Denmark","Total","15 to 29 years",2010,0.14000000000000001]
[null,"Denmark","Total","15 to 29 years",2011,0.14499999999999999]
[null,"Denmark","Total","15 to 29 years",2012,0.14199999999999999]
[null,"Denmark","Total","15 to 29 years",2013,0.13100000000000001]
[null,"Denmark","Total","15 to 29 years",2014,0.125]
[null,"Denmark","Total","15 to 29 years",2015,0.109]
[null,"Denmark","Total","15 to 29 years",2016,0.111]
[null,"Denmark","Total","15 to 29 years",2017,0.113]
[null,"Denmark","Total","15 to 29 years",2018,9.9000000000000005E-2]
[null,"Denmark","Total","15 to 29 years",2019,9.6999999999999989E-2]
[null,"Denmark","Total","15 to 29 years",2020,0.11]
[null,"Denmark","Total","15 to 29 years",2021,9.5000000000000001E-2]
[null,"Denmark","Total","15 to 29 years",2022,8.5999999999999993E-2]
[null,"Denmark","Total","15 to 29 years",2023,0.10099999999999999]
[null,"Denmark","Total","15 to 29 years",2024,0.12]
[null,"Estonia","Total","15 to 29 years",2010,0.24399999999999999]
[null,"Estonia","Total","15 to 29 years",2011,0.17600000000000002]
[null,"Estonia","Total","15 to 29 years",2012,0.152]
[null,"Estonia","Total","15 to 29 years",2013,0.13699999999999998]
[null,"Estonia","Total","15 to 29 years",2014,0.115]
[null,"Estonia","Total","15 to 29 years",2015,9.5000000000000001E-2]
[null,"Estonia","Total","15 to 29 years",2016,0.10300000000000001]
[null,"Estonia","Total","15 to 29 years",2017,8.199999999999999E-2]
[null,"Estonia","Total","15 to 29 years",2018,7.4999999999999997E-2]
[null,"Estonia","Total","15 to 29 years",2019,7.5999999999999998E-2]
[null,"Estonia","Total","15 to 29 years",2020,0.127]
[null,"Estonia","Total","15 to 29 years",2021,0.109]
[null,"Estonia","Total","15 to 29 years",2022,0.109]
[null,"Estonia","Total","15 to 29 years",2023,0.11599999999999999]
[null,"Estonia","Total","15 to 29 years",2024,0.14300000000000002]
[null,"Finland","Total","15 to 29 years",2010,0.159]
[null,"Finland","Total","15 to 29 years",2011,0.151]
[null,"Finland","Total","15 to 29 years",2012,0.14599999999999999]
[null,"Finland","Total","15 to 29 years",2013,0.154]
[null,"Finland","Total","15 to 29 years",2014,0.16]
[null,"Finland","Total","15 to 29 years",2015,0.17399999999999999]
[null,"Finland","Total","15 to 29 years",2016,0.158]
[null,"Finland","Total","15 to 29 years",2017,0.152]
[null,"Finland","Total","15 to 29 years",2018,0.13100000000000001]
[null,"Finland","Total","15 to 29 years",2019,0.125]
[null,"Finland","Total","15 to 29 years",2020,0.151]
[null,"Finland","Total","15 to 29 years",2021,0.13200000000000001]
[null,"Finland","Total","15 to 29 years",2022,0.11199999999999999]
[null,"Finland","Total","15 to 29 years",2023,0.127]
[null,"Finland","Total","15 to 29 years",2024,0.14899999999999999]
[null,"France","Total","15 to 29 years",2010,0.17499999999999999]
[null,"France","Total","15 to 29 years",2011,0.17399999999999999]
[null,"France","Total","15 to 29 years",2012,0.183]
[null,"France","Total","15 to 29 years",2013,0.191]
[null,"France","Total","15 to 29 years",2014,0.18899999999999997]
[null,"France","Total","15 to 29 years",2015,0.18899999999999997]
[null,"France","Total","15 to 29 years",2016,0.184]
[null,"France","Total","15 to 29 years",2017,0.16899999999999998]
[null,"France","Total","15 to 29 years",2018,0.16399999999999998]
[null,"France","Total","15 to 29 years",2019,0.152]
[null,"France","Total","15 to 29 years",2020,0.156]
[null,"France","Total","15 to 29 years",2021,0.14599999999999999]
[null,"France","Total","15 to 29 years",2022,0.13699999999999998]
[null,"France","Total","15 to 29 years",2023,0.13600000000000001]
[null,"France","Total","15 to 29 years",2024,0.14400000000000002]
[null,"Germany","Total","15 to 29 years",2010,8.6999999999999994E-2]
[null,"Germany","Total","15 to 29 years",2011,7.400000000000001E-2]
[null,"Germany","Total","15 to 29 years",2012,7.8E-2]
[null,"Germany","Total","15 to 29 years",2013,7.8E-2]
[null,"Germany","Total","15 to 29 years",2014,7.400000000000001E-2]
[null,"Germany","Total","15 to 29 years",2015,6.9000000000000006E-2]
[null,"Germany","Total","15 to 29 years",2016,6.5000000000000002E-2]
[null,"Germany","Total","15 to 29 years",2017,6.2E-2]
[null,"Germany","Total","15 to 29 years",2018,5.7000000000000002E-2]
[null,"Germany","Total","15 to 29 years",2019,5.2000000000000005E-2]
[null,"Germany","Total","15 to 29 years",2020,6.7000000000000004E-2]
[null,"Germany","Total","15 to 29 years",2021,0.06]
[null,"Germany","Total","15 to 29 years",2022,0.05]
[null,"Germany","Total","15 to 29 years",2023,0.05]
[null,"Germany","Total","15 to 29 years",2024,5.5E-2]
[null,"Greece","Total","15 to 29 years",2010,0.247]
[null,"Greece","Total","15 to 29 years",2011,0.35100000000000003]
[null,"Greece","Total","15 to 29 years",2012,0.442]
[null,"Greece","Total","15 to 29 years",2013,0.49099999999999999]
[null,"Greece","Total","15 to 29 years",2014,0.45100000000000001]
[null,"Greece","Total","15 to 29 years",2015,0.41299999999999998]
[null,"Greece","Total","15 to 29 years",2016,0.38799999999999996]
[null,"Greece","Total","15 to 29 years",2017,0.36099999999999999]
[null,"Greece","Total","15 to 29 years",2018,0.33]
[null,"Greece","Total","15 to 29 years",2019,0.29799999999999999]
[null,"Greece","Total","15 to 29 years",2020,0.317]
[null,"Greece","Total","15 to 29 years",2021,0.28399999999999997]
[null,"Greece","Total","15 to 29 years",2022,0.24299999999999999]
[null,"Greece","Total","15 to 29 years",2023,0.218]
[null,"Greece","Total","15 to 29 years",2024,0.191]
[null,"Hungary","Total","15 to 29 years",2010,0.182]
[null,"Hungary","Total","15 to 29 years",2011,0.17100000000000001]
[null,"Hungary","Total","15 to 29 years",2012,0.18899999999999997]
[null,"Hungary","Total","15 to 29 years",2013,0.17300000000000001]
[null,"Hungary","Total","15 to 29 years",2014,0.13500000000000001]
[null,"Hungary","Total","15 to 29 years",2015,0.11800000000000001]
[null,"Hungary","Total","15 to 29 years",2016,8.8000000000000009E-2]
[null,"Hungary","Total","15 to 29 years",2017,7.0000000000000007E-2]
[null,"Hungary","Total","15 to 29 years",2018,6.4000000000000001E-2]
[null,"Hungary","Total","15 to 29 years",2019,7.0999999999999994E-2]
[null,"Hungary","Total","15 to 29 years",2020,8.4000000000000005E-2]
[null,"Hungary","Total","15 to 29 years",2021,8.199999999999999E-2]
[null,"Hungary","Total","15 to 29 years",2022,6.7000000000000004E-2]
[null,"Hungary","Total","15 to 29 years",2023,0.08]
[null,"Hungary","Total","15 to 29 years",2024,9.1999999999999998E-2]
[null,"Ireland","Total","15 to 29 years",2010,0.23]
[null,"Ireland","Total","15 to 29 years",2011,0.25]
[null,"Ireland","Total","15 to 29 years",2012,0.24399999999999999]
[null,"Ireland","Total","15 to 29 years",2013,0.214]
[null,"Ireland","Total","15 to 29 years",2014,0.19600000000000001]
[null,"Ireland","Total","15 to 29 years",2015,0.16600000000000001]
[null,"Ireland","Total","15 to 29 years",2016,0.13900000000000001]
[null,"Ireland","Total","15 to 29 years",2017,0.115]
[null,"Ireland","Total","15 to 29 years",2018,0.106]
[null,"Ireland","Total","15 to 29 years",2019,9.6000000000000002E-2]
[null,"Ireland","Total","15 to 29 years",2020,0.122]
[null,"Ireland","Total","15 to 29 years",2021,0.11199999999999999]
[null,"Ireland","Total","15 to 29 years",2022,8.3000000000000004E-2]
[null,"Ireland","Total","15 to 29 years",2023,8.5999999999999993E-2]
[null,"Ireland","Total","15 to 29 years",2024,8.5999999999999993E-2]
[null,"Italy","Total","15 to 29 years",2010,0.20600000000000002]
[null,"Italy","Total","15 to 29 years",2011,0.20899999999999999]
[null,"Italy","Total","15 to 29 years",2012,0.25800000000000001]
[null,"Italy","Total","15 to 29 years",2013,0.30099999999999999]
[null,"Italy","Total","15 to 29 years",2014,0.31900000000000001]
[null,"Italy","Total","15 to 29 years",2015,0.3]
[null,"Italy","Total","15 to 29 years",2016,0.28499999999999998]
[null,"Italy","Total","15 to 29 years",2017,0.26700000000000002]
[null,"Italy","Total","15 to 29 years",2018,0.248]
[null,"Italy","Total","15 to 29 years",2019,0.22399999999999998]
[null,"Italy","Total","15 to 29 years",2020,0.22500000000000001]
[null,"Italy","Total","15 to 29 years",2021,0.223]
[null,"Italy","Total","15 to 29 years",2022,0.18]
[null,"Italy","Total","15 to 29 years",2023,0.16699999999999998]
[null,"Italy","Total","15 to 29 years",2024,0.14699999999999999]
[null,"Latvia","Total","15 to 29 years",2010,0.28499999999999998]
[null,"Latvia","Total","15 to 29 years",2011,0.23199999999999998]
[null,"Latvia","Total","15 to 29 years",2012,0.20899999999999999]
[null,"Latvia","Total","15 to 29 years",2013,0.16500000000000001]
[null,"Latvia","Total","15 to 29 years",2014,0.14400000000000002]
[null,"Latvia","Total","15 to 29 years",2015,0.129]
[null,"Latvia","Total","15 to 29 years",2016,0.13400000000000001]
[null,"Latvia","Total","15 to 29 years",2017,0.11599999999999999]
[null,"Latvia","Total","15 to 29 years",2018,0.106]
[null,"Latvia","Total","15 to 29 years",2019,9.3000000000000013E-2]
[null,"Latvia","Total","15 to 29 years",2020,0.13200000000000001]
[null,"Latvia","Total","15 to 29 years",2021,0.11199999999999999]
[null,"Latvia","Total","15 to 29 years",2022,0.111]
[null,"Latvia","Total","15 to 29 years",2023,9.5000000000000001E-2]
[null,"Latvia","Total","15 to 29 years",2024,0.11199999999999999]
[null,"Lithuania","Total","15 to 29 years",2010,0.27200000000000002]
[null,"Lithuania","Total","15 to 29 years",2011,0.23199999999999998]
[null,"Lithuania","Total","15 to 29 years",2012,0.19600000000000001]
[null,"Lithuania","Total","15 to 29 years",2013,0.17100000000000001]
[null,"Lithuania","Total","15 to 29 years",2014,0.14699999999999999]
[null,"Lithuania","Total","15 to 29 years",2015,0.127]
[null,"Lithuania","Total","15 to 29 years",2016,0.10400000000000001]
[null,"Lithuania","Total","15 to 29 years",2017,8.5999999999999993E-2]
[null,"Lithuania","Total","15 to 29 years",2018,7.4999999999999997E-2]
[null,"Lithuania","Total","15 to 29 years",2019,8.6999999999999994E-2]
[null,"Lithuania","Total","15 to 29 years",2020,0.13400000000000001]
[null,"Lithuania","Total","15 to 29 years",2021,0.1]
[null,"Lithuania","Total","15 to 29 years",2022,8.3000000000000004E-2]
[null,"Lithuania","Total","15 to 29 years",2023,9.8000000000000004E-2]
[null,"Lithuania","Total","15 to 29 years",2024,0.115]
[null,"Luxembourg","Total","15 to 29 years",2010,8.199999999999999E-2]
[null,"Luxembourg","Total","15 to 29 years",2011,9.8000000000000004E-2]
[null,"Luxembourg","Total","15 to 29 years",2012,0.109]
[null,"Luxembourg","Total","15 to 29 years",2013,0.11]
[null,"Luxembourg","Total","15 to 29 years",2014,0.126]
[null,"Luxembourg","Total","15 to 29 years",2015,0.11900000000000001]
[null,"Luxembourg","Total","15 to 29 years",2016,0.106]
[null,"Luxembourg","Total","15 to 29 years",2017,9.4E-2]
[null,"Luxembourg","Total","15 to 29 years",2018,0.10099999999999999]
[null,"Luxembourg","Total","15 to 29 years",2019,0.10800000000000001]
[null,"Luxembourg","Total","15 to 29 years",2020,0.13300000000000001]
[null,"Luxembourg","Total","15 to 29 years",2021,9.9000000000000005E-2]
[null,"Luxembourg","Total","15 to 29 years",2022,0.09]
[null,"Luxembourg","Total","15 to 29 years",2023,0.10400000000000001]
[null,"Luxembourg","Total","15 to 29 years",2024,0.13]
[null,"Malta","Total","15 to 29 years",2010,0.1]
[null,"Malta","Total","15 to 29 years",2011,9.8000000000000004E-2]
[null,"Malta","Total","15 to 29 years",2012,9.8000000000000004E-2]
[null,"Malta","Total","15 to 29 years",2013,9.1999999999999998E-2]
[null,"Malta","Total","15 to 29 years",2014,8.8000000000000009E-2]
[null,"Malta","Total","15 to 29 years",2015,8.5999999999999993E-2]
[null,"Malta","Total","15 to 29 years",2016,7.400000000000001E-2]
[null,"Malta","Total","15 to 29 years",2017,7.2999999999999995E-2]
[null,"Malta","Total","15 to 29 years",2018,5.5999999999999994E-2]
[null,"Malta","Total","15 to 29 years",2019,6.9000000000000006E-2]
[null,"Malta","Total","15 to 29 years",2020,7.8E-2]
[null,"Malta","Total","15 to 29 years",2021,7.0000000000000007E-2]
[null,"Malta","Total","15 to 29 years",2022,6.7000000000000004E-2]
[null,"Malta","Total","15 to 29 years",2023,6.4000000000000001E-2]
[null,"Malta","Total","15 to 29 years",2024,0.06]
[null,"Netherlands","Total","15 to 29 years",2010,0.10199999999999999]
[null,"Netherlands","Total","15 to 29 years",2011,9.5000000000000001E-2]
[null,"Netherlands","Total","15 to 29 years",2012,0.109]
[null,"Netherlands","Total","15 to 29 years",2013,0.12300000000000001]
[null,"Netherlands","Total","15 to 29 years",2014,0.11800000000000001]
[null,"Netherlands","Total","15 to 29 years",2015,0.106]
[null,"Netherlands","Total","15 to 29 years",2016,0.1]
[null,"Netherlands","Total","15 to 29 years",2017,8.5000000000000006E-2]
[null,"Netherlands","Total","15 to 29 years",2018,7.0999999999999994E-2]
[null,"Netherlands","Total","15 to 29 years",2019,7.0999999999999994E-2]
[null,"Netherlands","Total","15 to 29 years",2020,8.900000000000001E-2]
[null,"Netherlands","Total","15 to 29 years",2021,7.2999999999999995E-2]
[null,"Netherlands","Total","15 to 29 years",2022,6.3E-2]
[null,"Netherlands","Total","15 to 29 years",2023,6.7000000000000004E-2]
[null,"Netherlands","Total","15 to 29 years",2024,7.0000000000000007E-2]
[null,"Poland","Total","15 to 29 years",2010,0.17300000000000001]
[null,"Poland","Total","15 to 29 years",2011,0.17899999999999999]
[null,"Poland","Total","15 to 29 years",2012,0.188]
[null,"Poland","Total","15 to 29 years",2013,0.193]
[null,"Poland","Total","15 to 29 years",2014,0.16899999999999998]
[null,"Poland","Total","15 to 29 years",2015,0.14499999999999999]
[null,"Poland","Total","15 to 29 years",2016,0.12]
[null,"Poland","Total","15 to 29 years",2017,9.5000000000000001E-2]
[null,"Poland","Total","15 to 29 years",2018,7.6999999999999999E-2]
[null,"Poland","Total","15 to 29 years",2019,6.5000000000000002E-2]
[null,"Poland","Total","15 to 29 years",2020,7.0999999999999994E-2]
[null,"Poland","Total","15 to 29 years",2021,7.2999999999999995E-2]
[null,"Poland","Total","15 to 29 years",2022,6.7000000000000004E-2]
[null,"Poland","Total","15 to 29 years",2023,6.7000000000000004E-2]
[null,"Poland","Total","15 to 29 years",2024,6.7000000000000004E-2]
[null,"Portugal","Total","15 to 29 years",2010,0.20100000000000001]
[null,"Portugal","Total","15 to 29 years",2011,0.22800000000000001]
[null,"Portugal","Total","15 to 29 years",2012,0.28499999999999998]
[null,"Portugal","Total","15 to 29 years",2013,0.29699999999999999]
[null,"Portugal","Total","15 to 29 years",2014,0.25800000000000001]
[null,"Portugal","Total","15 to 29 years",2015,0.23]
[null,"Portugal","Total","15 to 29 years",2016,0.21199999999999999]
[null,"Portugal","Total","15 to 29 years",2017,0.17]
[null,"Portugal","Total","15 to 29 years",2018,0.14199999999999999]
[null,"Portugal","Total","15 to 29 years",2019,0.127]
[null,"Portugal","Total","15 to 29 years",2020,0.159]
[null,"Portugal","Total","15 to 29 years",2021,0.156]
[null,"Portugal","Total","15 to 29 years",2022,0.13500000000000001]
[null,"Portugal","Total","15 to 29 years",2023,0.14199999999999999]
[null,"Portugal","Total","15 to 29 years",2024,0.14199999999999999]
[null,"Romania","Total","15 to 29 years",2010,0.184]
[null,"Romania","Total","15 to 29 years",2011,0.18899999999999997]
[null,"Romania","Total","15 to 29 years",2012,0.188]
[null,"Romania","Total","15 to 29 years",2013,0.191]
[null,"Romania","Total","15 to 29 years",2014,0.188]
[null,"Romania","Total","15 to 29 years",2015,0.17199999999999999]
[null,"Romania","Total","15 to 29 years",2016,0.155]
[null,"Romania","Total","15 to 29 years",2017,0.14000000000000001]
[null,"Romania","Total","15 to 29 years",2018,0.122]
[null,"Romania","Total","15 to 29 years",2019,0.12300000000000001]
[null,"Romania","Total","15 to 29 years",2020,0.13600000000000001]
[null,"Romania","Total","15 to 29 years",2021,0.13100000000000001]
[null,"Romania","Total","15 to 29 years",2022,0.14099999999999999]
[null,"Romania","Total","15 to 29 years",2023,0.13]
[null,"Romania","Total","15 to 29 years",2024,0.14099999999999999]
[null,"Slovakia","Total","15 to 29 years",2010,0.23199999999999998]
[null,"Slovakia","Total","15 to 29 years",2011,0.23100000000000001]
[null,"Slovakia","Total","15 to 29 years",2012,0.23899999999999999]
[null,"Slovakia","Total","15 to 29 years",2013,0.24100000000000002]
[null,"Slovakia","Total","15 to 29 years",2014,0.21100000000000002]
[null,"Slovakia","Total","15 to 29 years",2015,0.17499999999999999]
[null,"Slovakia","Total","15 to 29 years",2016,0.155]
[null,"Slovakia","Total","15 to 29 years",2017,0.13300000000000001]
[null,"Slovakia","Total","15 to 29 years",2018,0.109]
[null,"Slovakia","Total","15 to 29 years",2019,9.6000000000000002E-2]
[null,"Slovakia","Total","15 to 29 years",2020,0.12300000000000001]
[null,"Slovakia","Total","15 to 29 years",2021,0.129]
[null,"Slovakia","Total","15 to 29 years",2022,0.114]
[null,"Slovakia","Total","15 to 29 years",2023,0.11599999999999999]
[null,"Slovakia","Total","15 to 29 years",2024,0.11199999999999999]
[null,"Slovenia","Total","15 to 29 years",2010,0.13699999999999998]
[null,"Slovenia","Total","15 to 29 years",2011,0.14800000000000002]
[null,"Slovenia","Total","15 to 29 years",2012,0.17199999999999999]
[null,"Slovenia","Total","15 to 29 years",2013,0.19]
[null,"Slovenia","Total","15 to 29 years",2014,0.18899999999999997]
[null,"Slovenia","Total","15 to 29 years",2015,0.16200000000000001]
[null,"Slovenia","Total","15 to 29 years",2016,0.14699999999999999]
[null,"Slovenia","Total","15 to 29 years",2017,0.10800000000000001]
[null,"Slovenia","Total","15 to 29 years",2018,8.900000000000001E-2]
[null,"Slovenia","Total","15 to 29 years",2019,7.4999999999999997E-2]
[null,"Slovenia","Total","15 to 29 years",2020,9.6999999999999989E-2]
[null,"Slovenia","Total","15 to 29 years",2021,9.6000000000000002E-2]
[null,"Slovenia","Total","15 to 29 years",2022,8.199999999999999E-2]
[null,"Slovenia","Total","15 to 29 years",2023,7.4999999999999997E-2]
[null,"Slovenia","Total","15 to 29 years",2024,0.08]
[null,"Spain","Total","15 to 29 years",2010,0.317]
[null,"Spain","Total","15 to 29 years",2011,0.34600000000000003]
[null,"Spain","Total","15 to 29 years",2012,0.40299999999999997]
[null,"Spain","Total","15 to 29 years",2013,0.42399999999999999]
[null,"Spain","Total","15 to 29 years",2014,0.39700000000000002]
[null,"Spain","Total","15 to 29 years",2015,0.36700000000000005]
[null,"Spain","Total","15 to 29 years",2016,0.33299999999999996]
[null,"Spain","Total","15 to 29 years",2017,0.29399999999999998]
[null,"Spain","Total","15 to 29 years",2018,0.26200000000000001]
[null,"Spain","Total","15 to 29 years",2019,0.247]
[null,"Spain","Total","15 to 29 years",2020,0.29199999999999998]
[null,"Spain","Total","15 to 29 years",2021,0.27200000000000002]
[null,"Spain","Total","15 to 29 years",2022,0.223]
[null,"Spain","Total","15 to 29 years",2023,0.214]
[null,"Spain","Total","15 to 29 years",2024,0.20199999999999999]
[null,"Sweden","Total","15 to 29 years",2010,0.18600000000000003]
[null,"Sweden","Total","15 to 29 years",2011,0.16899999999999998]
[null,"Sweden","Total","15 to 29 years",2012,0.17600000000000002]
[null,"Sweden","Total","15 to 29 years",2013,0.17399999999999999]
[null,"Sweden","Total","15 to 29 years",2014,0.16800000000000001]
[null,"Sweden","Total","15 to 29 years",2015,0.151]
[null,"Sweden","Total","15 to 29 years",2016,0.13699999999999998]
[null,"Sweden","Total","15 to 29 years",2017,0.13]
[null,"Sweden","Total","15 to 29 years",2018,0.125]
[null,"Sweden","Total","15 to 29 years",2019,0.14000000000000001]
[null,"Sweden","Total","15 to 29 years",2020,0.17]
[null,"Sweden","Total","15 to 29 years",2021,0.17499999999999999]
[null,"Sweden","Total","15 to 29 years",2022,0.153]
[null,"Sweden","Total","15 to 29 years",2023,0.16]
[null,"Sweden","Total","15 to 29 years",2024,0.17300000000000001]
[null,"Austria","Total","15 to 74 years",2010,5.2000000000000005E-2]
[null,"Austria","Total","15 to 74 years",2011,4.9000000000000002E-2]
[null,"Austria","Total","15 to 74 years",2012,5.2000000000000005E-2]
[null,"Austria","Total","15 to 74 years",2013,5.7000000000000002E-2]
[null,"Austria","Total","15 to 74 years",2014,0.06]
[null,"Austria","Total","15 to 74 years",2015,6.0999999999999999E-2]
[null,"Austria","Total","15 to 74 years",2016,6.5000000000000002E-2]
[null,"Austria","Total","15 to 74 years",2017,5.9000000000000004E-2]
[null,"Austria","Total","15 to 74 years",2018,5.2000000000000005E-2]
[null,"Austria","Total","15 to 74 years",2019,4.8000000000000001E-2]
[null,"Austria","Total","15 to 74 years",2020,0.06]
[null,"Austria","Total","15 to 74 years",2021,6.2E-2]
[null,"Austria","Total","15 to 74 years",2022,4.8000000000000001E-2]
[null,"Austria","Total","15 to 74 years",2023,5.0999999999999997E-2]
[null,"Austria","Total","15 to 74 years",2024,5.2000000000000005E-2]
[null,"Belgium","Total","15 to 74 years",2010,8.4000000000000005E-2]
[null,"Belgium","Total","15 to 74 years",2011,7.2000000000000008E-2]
[null,"Belgium","Total","15 to 74 years",2012,7.5999999999999998E-2]
[null,"Belgium","Total","15 to 74 years",2013,8.5999999999999993E-2]
[null,"Belgium","Total","15 to 74 years",2014,8.6999999999999994E-2]
[null,"Belgium","Total","15 to 74 years",2015,8.6999999999999994E-2]
[null,"Belgium","Total","15 to 74 years",2016,7.9000000000000001E-2]
[null,"Belgium","Total","15 to 74 years",2017,7.2000000000000008E-2]
[null,"Belgium","Total","15 to 74 years",2018,0.06]
[null,"Belgium","Total","15 to 74 years",2019,5.5E-2]
[null,"Belgium","Total","15 to 74 years",2020,5.7999999999999996E-2]
[null,"Belgium","Total","15 to 74 years",2021,6.3E-2]
[null,"Belgium","Total","15 to 74 years",2022,5.5999999999999994E-2]
[null,"Belgium","Total","15 to 74 years",2023,5.5E-2]
[null,"Belgium","Total","15 to 74 years",2024,5.7000000000000002E-2]
[null,"Bulgaria","Total","15 to 74 years",2010,0.113]
[null,"Bulgaria","Total","15 to 74 years",2011,0.12300000000000001]
[null,"Bulgaria","Total","15 to 74 years",2012,0.13300000000000001]
[null,"Bulgaria","Total","15 to 74 years",2013,0.13900000000000001]
[null,"Bulgaria","Total","15 to 74 years",2014,0.124]
[null,"Bulgaria","Total","15 to 74 years",2015,0.10099999999999999]
[null,"Bulgaria","Total","15 to 74 years",2016,8.5999999999999993E-2]
[null,"Bulgaria","Total","15 to 74 years",2017,7.2000000000000008E-2]
[null,"Bulgaria","Total","15 to 74 years",2018,6.2E-2]
[null,"Bulgaria","Total","15 to 74 years",2019,5.2000000000000005E-2]
[null,"Bulgaria","Total","15 to 74 years",2020,6.0999999999999999E-2]
[null,"Bulgaria","Total","15 to 74 years",2021,5.2000000000000005E-2]
[null,"Bulgaria","Total","15 to 74 years",2022,4.2000000000000003E-2]
[null,"Bulgaria","Total","15 to 74 years",2023,4.2999999999999997E-2]
[null,"Bulgaria","Total","15 to 74 years",2024,4.2000000000000003E-2]
[null,"Croatia","Total","15 to 74 years",2010,0.11699999999999999]
[null,"Croatia","Total","15 to 74 years",2011,0.13699999999999998]
[null,"Croatia","Total","15 to 74 years",2012,0.161]
[null,"Croatia","Total","15 to 74 years",2013,0.17300000000000001]
[null,"Croatia","Total","15 to 74 years",2014,0.17300000000000001]
[null,"Croatia","Total","15 to 74 years",2015,0.16200000000000001]
[null,"Croatia","Total","15 to 74 years",2016,0.13]
[null,"Croatia","Total","15 to 74 years",2017,0.111]
[null,"Croatia","Total","15 to 74 years",2018,8.3000000000000004E-2]
[null,"Croatia","Total","15 to 74 years",2019,6.6000000000000003E-2]
[null,"Croatia","Total","15 to 74 years",2020,7.400000000000001E-2]
[null,"Croatia","Total","15 to 74 years",2021,7.4999999999999997E-2]
[null,"Croatia","Total","15 to 74 years",2022,6.8000000000000005E-2]
[null,"Croatia","Total","15 to 74 years",2023,6.0999999999999999E-2]
[null,"Croatia","Total","15 to 74 years",2024,0.05]
[null,"Cyprus","Total","15 to 74 years",2010,6.3E-2]
[null,"Cyprus","Total","15 to 74 years",2011,7.9000000000000001E-2]
[null,"Cyprus","Total","15 to 74 years",2012,0.11900000000000001]
[null,"Cyprus","Total","15 to 74 years",2013,0.159]
[null,"Cyprus","Total","15 to 74 years",2014,0.161]
[null,"Cyprus","Total","15 to 74 years",2015,0.15]
[null,"Cyprus","Total","15 to 74 years",2016,0.13]
[null,"Cyprus","Total","15 to 74 years",2017,0.111]
[null,"Cyprus","Total","15 to 74 years",2018,8.4000000000000005E-2]
[null,"Cyprus","Total","15 to 74 years",2019,7.2000000000000008E-2]
[null,"Cyprus","Total","15 to 74 years",2020,7.5999999999999998E-2]
[null,"Cyprus","Total","15 to 74 years",2021,7.2000000000000008E-2]
[null,"Cyprus","Total","15 to 74 years",2022,6.3E-2]
[null,"Cyprus","Total","15 to 74 years",2023,5.7999999999999996E-2]
[null,"Cyprus","Total","15 to 74 years",2024,4.9000000000000002E-2]
[null,"Czechia","Total","15 to 74 years",2010,7.2999999999999995E-2]
[null,"Czechia","Total","15 to 74 years",2011,6.7000000000000004E-2]
[null,"Czechia","Total","15 to 74 years",2012,7.0000000000000007E-2]
[null,"Czechia","Total","15 to 74 years",2013,7.0000000000000007E-2]
[null,"Czechia","Total","15 to 74 years",2014,6.0999999999999999E-2]
[null,"Czechia","Total","15 to 74 years",2015,5.0999999999999997E-2]
[null,"Czechia","Total","15 to 74 years",2016,0.04]
[null,"Czechia","Total","15 to 74 years",2017,2.8999999999999998E-2]
[null,"Czechia","Total","15 to 74 years",2018,2.2000000000000002E-2]
[null,"Czechia","Total","15 to 74 years",2019,0.02]
[null,"Czechia","Total","15 to 74 years",2020,2.6000000000000002E-2]
[null,"Czechia","Total","15 to 74 years",2021,2.7999999999999997E-2]
[null,"Czechia","Total","15 to 74 years",2022,2.2000000000000002E-2]
[null,"Czechia","Total","15 to 74 years",2023,2.6000000000000002E-2]
[null,"Czechia","Total","15 to 74 years",2024,2.6000000000000002E-2]
[null,"Denmark","Total","15 to 74 years",2010,7.6999999999999999E-2]
[null,"Denmark","Total","15 to 74 years",2011,7.8E-2]
[null,"Denmark","Total","15 to 74 years",2012,7.8E-2]
[null,"Denmark","Total","15 to 74 years",2013,7.400000000000001E-2]
[null,"Denmark","Total","15 to 74 years",2014,6.9000000000000006E-2]
[null,"Denmark","Total","15 to 74 years",2015,6.3E-2]
[null,"Denmark","Total","15 to 74 years",2016,0.06]
[null,"Denmark","Total","15 to 74 years",2017,5.7999999999999996E-2]
[null,"Denmark","Total","15 to 74 years",2018,5.0999999999999997E-2]
[null,"Denmark","Total","15 to 74 years",2019,0.05]
[null,"Denmark","Total","15 to 74 years",2020,5.5999999999999994E-2]
[null,"Denmark","Total","15 to 74 years",2021,5.0999999999999997E-2]
[null,"Denmark","Total","15 to 74 years",2022,4.4999999999999998E-2]
[null,"Denmark","Total","15 to 74 years",2023,5.0999999999999997E-2]
[null,"Denmark","Total","15 to 74 years",2024,6.2E-2]
[null,"Estonia","Total","15 to 74 years",2010,0.16600000000000001]
[null,"Estonia","Total","15 to 74 years",2011,0.12300000000000001]
[null,"Estonia","Total","15 to 74 years",2012,9.9000000000000005E-2]
[null,"Estonia","Total","15 to 74 years",2013,8.5999999999999993E-2]
[null,"Estonia","Total","15 to 74 years",2014,7.2999999999999995E-2]
[null,"Estonia","Total","15 to 74 years",2015,6.4000000000000001E-2]
[null,"Estonia","Total","15 to 74 years",2016,6.8000000000000005E-2]
[null,"Estonia","Total","15 to 74 years",2017,5.7999999999999996E-2]
[null,"Estonia","Total","15 to 74 years",2018,5.4000000000000006E-2]
[null,"Estonia","Total","15 to 74 years",2019,4.4999999999999998E-2]
[null,"Estonia","Total","15 to 74 years",2020,6.9000000000000006E-2]
[null,"Estonia","Total","15 to 74 years",2021,6.2E-2]
[null,"Estonia","Total","15 to 74 years",2022,5.5999999999999994E-2]
[null,"Estonia","Total","15 to 74 years",2023,6.4000000000000001E-2]
[null,"Estonia","Total","15 to 74 years",2024,7.5999999999999998E-2]
[null,"Finland","Total","15 to 74 years",2010,8.5999999999999993E-2]
[null,"Finland","Total","15 to 74 years",2011,0.08]
[null,"Finland","Total","15 to 74 years",2012,7.9000000000000001E-2]
[null,"Finland","Total","15 to 74 years",2013,8.3000000000000004E-2]
[null,"Finland","Total","15 to 74 years",2014,8.6999999999999994E-2]
[null,"Finland","Total","15 to 74 years",2015,9.4E-2]
[null,"Finland","Total","15 to 74 years",2016,8.900000000000001E-2]
[null,"Finland","Total","15 to 74 years",2017,8.6999999999999994E-2]
[null,"Finland","Total","15 to 74 years",2018,7.4999999999999997E-2]
[null,"Finland","Total","15 to 74 years",2019,6.8000000000000005E-2]
[null,"Finland","Total","15 to 74 years",2020,7.6999999999999999E-2]
[null,"Finland","Total","15 to 74 years",2021,7.6999999999999999E-2]
[null,"Finland","Total","15 to 74 years",2022,6.8000000000000005E-2]
[null,"Finland","Total","15 to 74 years",2023,7.2000000000000008E-2]
[null,"Finland","Total","15 to 74 years",2024,8.4000000000000005E-2]
[null,"France","Total","15 to 74 years",2010,9.3000000000000013E-2]
[null,"France","Total","15 to 74 years",2011,9.1999999999999998E-2]
[null,"France","Total","15 to 74 years",2012,9.8000000000000004E-2]
[null,"France","Total","15 to 74 years",2013,0.10300000000000001]
[null,"France","Total","15 to 74 years",2014,0.10300000000000001]
[null,"France","Total","15 to 74 years",2015,0.10300000000000001]
[null,"France","Total","15 to 74 years",2016,0.10099999999999999]
[null,"France","Total","15 to 74 years",2017,9.4E-2]
[null,"France","Total","15 to 74 years",2018,0.09]
[null,"France","Total","15 to 74 years",2019,8.4000000000000005E-2]
[null,"France","Total","15 to 74 years",2020,0.08]
[null,"France","Total","15 to 74 years",2021,7.9000000000000001E-2]
[null,"France","Total","15 to 74 years",2022,7.2999999999999995E-2]
[null,"France","Total","15 to 74 years",2023,7.2999999999999995E-2]
[null,"France","Total","15 to 74 years",2024,7.400000000000001E-2]
[null,"Germany","Total","15 to 74 years",2010,6.6000000000000003E-2]
[null,"Germany","Total","15 to 74 years",2011,5.5E-2]
[null,"Germany","Total","15 to 74 years",2012,5.0999999999999997E-2]
[null,"Germany","Total","15 to 74 years",2013,4.9000000000000002E-2]
[null,"Germany","Total","15 to 74 years",2014,4.7E-2]
[null,"Germany","Total","15 to 74 years",2015,4.4000000000000004E-2]
[null,"Germany","Total","15 to 74 years",2016,3.9E-2]
[null,"Germany","Total","15 to 74 years",2017,3.5000000000000003E-2]
[null,"Germany","Total","15 to 74 years",2018,3.2000000000000001E-2]
[null,"Germany","Total","15 to 74 years",2019,2.8999999999999998E-2]
[null,"Germany","Total","15 to 74 years",2020,3.6000000000000004E-2]
[null,"Germany","Total","15 to 74 years",2021,3.6000000000000004E-2]
[null,"Germany","Total","15 to 74 years",2022,3.1E-2]
[null,"Germany","Total","15 to 74 years",2023,3.1E-2]
[null,"Germany","Total","15 to 74 years",2024,3.4000000000000002E-2]
[null,"Greece","Total","15 to 74 years",2010,0.129]
[null,"Greece","Total","15 to 74 years",2011,0.18100000000000002]
[null,"Greece","Total","15 to 74 years",2012,0.248]
[null,"Greece","Total","15 to 74 years",2013,0.27800000000000002]
[null,"Greece","Total","15 to 74 years",2014,0.26600000000000001]
[null,"Greece","Total","15 to 74 years",2015,0.25]
[null,"Greece","Total","15 to 74 years",2016,0.23899999999999999]
[null,"Greece","Total","15 to 74 years",2017,0.218]
[null,"Greece","Total","15 to 74 years",2018,0.19699999999999998]
[null,"Greece","Total","15 to 74 years",2019,0.17899999999999999]
[null,"Greece","Total","15 to 74 years",2020,0.17600000000000002]
[null,"Greece","Total","15 to 74 years",2021,0.14699999999999999]
[null,"Greece","Total","15 to 74 years",2022,0.125]
[null,"Greece","Total","15 to 74 years",2023,0.111]
[null,"Greece","Total","15 to 74 years",2024,0.10099999999999999]
[null,"Hungary","Total","15 to 74 years",2010,0.10800000000000001]
[null,"Hungary","Total","15 to 74 years",2011,0.107]
[null,"Hungary","Total","15 to 74 years",2012,0.107]
[null,"Hungary","Total","15 to 74 years",2013,9.8000000000000004E-2]
[null,"Hungary","Total","15 to 74 years",2014,7.4999999999999997E-2]
[null,"Hungary","Total","15 to 74 years",2015,6.6000000000000003E-2]
[null,"Hungary","Total","15 to 74 years",2016,0.05]
[null,"Hungary","Total","15 to 74 years",2017,0.04]
[null,"Hungary","Total","15 to 74 years",2018,3.6000000000000004E-2]
[null,"Hungary","Total","15 to 74 years",2019,3.3000000000000002E-2]
[null,"Hungary","Total","15 to 74 years",2020,4.0999999999999995E-2]
[null,"Hungary","Total","15 to 74 years",2021,0.04]
[null,"Hungary","Total","15 to 74 years",2022,3.6000000000000004E-2]
[null,"Hungary","Total","15 to 74 years",2023,4.0999999999999995E-2]
[null,"Hungary","Total","15 to 74 years",2024,4.4999999999999998E-2]
[null,"Ireland","Total","15 to 74 years",2010,0.14599999999999999]
[null,"Ireland","Total","15 to 74 years",2011,0.154]
[null,"Ireland","Total","15 to 74 years",2012,0.155]
[null,"Ireland","Total","15 to 74 years",2013,0.13800000000000001]
[null,"Ireland","Total","15 to 74 years",2014,0.11900000000000001]
[null,"Ireland","Total","15 to 74 years",2015,9.9000000000000005E-2]
[null,"Ireland","Total","15 to 74 years",2016,8.4000000000000005E-2]
[null,"Ireland","Total","15 to 74 years",2017,6.7000000000000004E-2]
[null,"Ireland","Total","15 to 74 years",2018,5.7999999999999996E-2]
[null,"Ireland","Total","15 to 74 years",2019,0.05]
[null,"Ireland","Total","15 to 74 years",2020,5.9000000000000004E-2]
[null,"Ireland","Total","15 to 74 years",2021,6.2E-2]
[null,"Ireland","Total","15 to 74 years",2022,4.4999999999999998E-2]
[null,"Ireland","Total","15 to 74 years",2023,4.2999999999999997E-2]
[null,"Ireland","Total","15 to 74 years",2024,4.2999999999999997E-2]
[null,"Italy","Total","15 to 74 years",2010,8.5000000000000006E-2]
[null,"Italy","Total","15 to 74 years",2011,8.5000000000000006E-2]
[null,"Italy","Total","15 to 74 years",2012,0.109]
[null,"Italy","Total","15 to 74 years",2013,0.124]
[null,"Italy","Total","15 to 74 years",2014,0.129]
[null,"Italy","Total","15 to 74 years",2015,0.12]
[null,"Italy","Total","15 to 74 years",2016,0.11699999999999999]
[null,"Italy","Total","15 to 74 years",2017,0.113]
[null,"Italy","Total","15 to 74 years",2018,0.106]
[null,"Italy","Total","15 to 74 years",2019,9.9000000000000005E-2]
[null,"Italy","Total","15 to 74 years",2020,9.3000000000000013E-2]
[null,"Italy","Total","15 to 74 years",2021,9.5000000000000001E-2]
[null,"Italy","Total","15 to 74 years",2022,8.1000000000000003E-2]
[null,"Italy","Total","15 to 74 years",2023,7.6999999999999999E-2]
[null,"Italy","Total","15 to 74 years",2024,6.5000000000000002E-2]
[null,"Latvia","Total","15 to 74 years",2010,0.19699999999999998]
[null,"Latvia","Total","15 to 74 years",2011,0.16300000000000001]
[null,"Latvia","Total","15 to 74 years",2012,0.151]
[null,"Latvia","Total","15 to 74 years",2013,0.11900000000000001]
[null,"Latvia","Total","15 to 74 years",2014,0.109]
[null,"Latvia","Total","15 to 74 years",2015,9.9000000000000005E-2]
[null,"Latvia","Total","15 to 74 years",2016,9.6999999999999989E-2]
[null,"Latvia","Total","15 to 74 years",2017,8.6999999999999994E-2]
[null,"Latvia","Total","15 to 74 years",2018,7.400000000000001E-2]
[null,"Latvia","Total","15 to 74 years",2019,6.3E-2]
[null,"Latvia","Total","15 to 74 years",2020,8.1000000000000003E-2]
[null,"Latvia","Total","15 to 74 years",2021,7.5999999999999998E-2]
[null,"Latvia","Total","15 to 74 years",2022,6.9000000000000006E-2]
[null,"Latvia","Total","15 to 74 years",2023,6.5000000000000002E-2]
[null,"Latvia","Total","15 to 74 years",2024,6.9000000000000006E-2]
[null,"Lithuania","Total","15 to 74 years",2010,0.17800000000000002]
[null,"Lithuania","Total","15 to 74 years",2011,0.154]
[null,"Lithuania","Total","15 to 74 years",2012,0.13400000000000001]
[null,"Lithuania","Total","15 to 74 years",2013,0.11800000000000001]
[null,"Lithuania","Total","15 to 74 years",2014,0.107]
[null,"Lithuania","Total","15 to 74 years",2015,9.0999999999999998E-2]
[null,"Lithuania","Total","15 to 74 years",2016,7.9000000000000001E-2]
[null,"Lithuania","Total","15 to 74 years",2017,7.0999999999999994E-2]
[null,"Lithuania","Total","15 to 74 years",2018,6.2E-2]
[null,"Lithuania","Total","15 to 74 years",2019,6.3E-2]
[null,"Lithuania","Total","15 to 74 years",2020,8.5000000000000006E-2]
[null,"Lithuania","Total","15 to 74 years",2021,7.0999999999999994E-2]
[null,"Lithuania","Total","15 to 74 years",2022,0.06]
[null,"Lithuania","Total","15 to 74 years",2023,6.9000000000000006E-2]
[null,"Lithuania","Total","15 to 74 years",2024,7.0999999999999994E-2]
[null,"Luxembourg","Total","15 to 74 years",2010,4.4000000000000004E-2]
[null,"Luxembourg","Total","15 to 74 years",2011,4.9000000000000002E-2]
[null,"Luxembourg","Total","15 to 74 years",2012,5.0999999999999997E-2]
[null,"Luxembourg","Total","15 to 74 years",2013,5.9000000000000004E-2]
[null,"Luxembourg","Total","15 to 74 years",2014,5.9000000000000004E-2]
[null,"Luxembourg","Total","15 to 74 years",2015,6.7000000000000004E-2]
[null,"Luxembourg","Total","15 to 74 years",2016,6.3E-2]
[null,"Luxembourg","Total","15 to 74 years",2017,5.5E-2]
[null,"Luxembourg","Total","15 to 74 years",2018,5.5999999999999994E-2]
[null,"Luxembourg","Total","15 to 74 years",2019,5.5999999999999994E-2]
[null,"Luxembourg","Total","15 to 74 years",2020,6.8000000000000005E-2]
[null,"Luxembourg","Total","15 to 74 years",2021,5.2999999999999999E-2]
[null,"Luxembourg","Total","15 to 74 years",2022,4.5999999999999999E-2]
[null,"Luxembourg","Total","15 to 74 years",2023,5.2000000000000005E-2]
[null,"Luxembourg","Total","15 to 74 years",2024,6.4000000000000001E-2]
[null,"Malta","Total","15 to 74 years",2010,6.9000000000000006E-2]
[null,"Malta","Total","15 to 74 years",2011,6.4000000000000001E-2]
[null,"Malta","Total","15 to 74 years",2012,6.2E-2]
[null,"Malta","Total","15 to 74 years",2013,6.0999999999999999E-2]
[null,"Malta","Total","15 to 74 years",2014,5.7000000000000002E-2]
[null,"Malta","Total","15 to 74 years",2015,5.4000000000000006E-2]
[null,"Malta","Total","15 to 74 years",2016,4.7E-2]
[null,"Malta","Total","15 to 74 years",2017,0.04]
[null,"Malta","Total","15 to 74 years",2018,0.04]
[null,"Malta","Total","15 to 74 years",2019,4.0999999999999995E-2]
[null,"Malta","Total","15 to 74 years",2020,4.9000000000000002E-2]
[null,"Malta","Total","15 to 74 years",2021,3.7999999999999999E-2]
[null,"Malta","Total","15 to 74 years",2022,3.5000000000000003E-2]
[null,"Malta","Total","15 to 74 years",2023,3.5000000000000003E-2]
[null,"Malta","Total","15 to 74 years",2024,3.1E-2]
[null,"Netherlands","Total","15 to 74 years",2010,6.0999999999999999E-2]
[null,"Netherlands","Total","15 to 74 years",2011,0.06]
[null,"Netherlands","Total","15 to 74 years",2012,6.8000000000000005E-2]
[null,"Netherlands","Total","15 to 74 years",2013,8.199999999999999E-2]
[null,"Netherlands","Total","15 to 74 years",2014,8.4000000000000005E-2]
[null,"Netherlands","Total","15 to 74 years",2015,7.9000000000000001E-2]
[null,"Netherlands","Total","15 to 74 years",2016,7.0000000000000007E-2]
[null,"Netherlands","Total","15 to 74 years",2017,5.9000000000000004E-2]
[null,"Netherlands","Total","15 to 74 years",2018,4.9000000000000002E-2]
[null,"Netherlands","Total","15 to 74 years",2019,4.4000000000000004E-2]
[null,"Netherlands","Total","15 to 74 years",2020,4.9000000000000002E-2]
[null,"Netherlands","Total","15 to 74 years",2021,4.2000000000000003E-2]
[null,"Netherlands","Total","15 to 74 years",2022,3.5000000000000003E-2]
[null,"Netherlands","Total","15 to 74 years",2023,3.6000000000000004E-2]
[null,"Netherlands","Total","15 to 74 years",2024,3.7000000000000005E-2]
[null,"Poland","Total","15 to 74 years",2010,0.1]
[null,"Poland","Total","15 to 74 years",2011,0.1]
[null,"Poland","Total","15 to 74 years",2012,0.10400000000000001]
[null,"Poland","Total","15 to 74 years",2013,0.106]
[null,"Poland","Total","15 to 74 years",2014,9.1999999999999998E-2]
[null,"Poland","Total","15 to 74 years",2015,7.6999999999999999E-2]
[null,"Poland","Total","15 to 74 years",2016,6.3E-2]
[null,"Poland","Total","15 to 74 years",2017,0.05]
[null,"Poland","Total","15 to 74 years",2018,3.9E-2]
[null,"Poland","Total","15 to 74 years",2019,3.3000000000000002E-2]
[null,"Poland","Total","15 to 74 years",2020,3.2000000000000001E-2]
[null,"Poland","Total","15 to 74 years",2021,3.4000000000000002E-2]
[null,"Poland","Total","15 to 74 years",2022,2.8999999999999998E-2]
[null,"Poland","Total","15 to 74 years",2023,2.7999999999999997E-2]
[null,"Poland","Total","15 to 74 years",2024,2.8999999999999998E-2]
[null,"Portugal","Total","15 to 74 years",2010,0.126]
[null,"Portugal","Total","15 to 74 years",2011,0.13500000000000001]
[null,"Portugal","Total","15 to 74 years",2012,0.16600000000000001]
[null,"Portugal","Total","15 to 74 years",2013,0.17199999999999999]
[null,"Portugal","Total","15 to 74 years",2014,0.14599999999999999]
[null,"Portugal","Total","15 to 74 years",2015,0.13]
[null,"Portugal","Total","15 to 74 years",2016,0.115]
[null,"Portugal","Total","15 to 74 years",2017,9.1999999999999998E-2]
[null,"Portugal","Total","15 to 74 years",2018,7.2000000000000008E-2]
[null,"Portugal","Total","15 to 74 years",2019,6.6000000000000003E-2]
[null,"Portugal","Total","15 to 74 years",2020,7.0999999999999994E-2]
[null,"Portugal","Total","15 to 74 years",2021,6.7000000000000004E-2]
[null,"Portugal","Total","15 to 74 years",2022,6.2E-2]
[null,"Portugal","Total","15 to 74 years",2023,6.5000000000000002E-2]
[null,"Portugal","Total","15 to 74 years",2024,6.5000000000000002E-2]
[null,"Romania","Total","15 to 74 years",2010,0.09]
[null,"Romania","Total","15 to 74 years",2011,9.0999999999999998E-2]
[null,"Romania","Total","15 to 74 years",2012,8.6999999999999994E-2]
[null,"Romania","Total","15 to 74 years",2013,0.09]
[null,"Romania","Total","15 to 74 years",2014,8.5999999999999993E-2]
[null,"Romania","Total","15 to 74 years",2015,8.4000000000000005E-2]
[null,"Romania","Total","15 to 74 years",2016,7.2000000000000008E-2]
[null,"Romania","Total","15 to 74 years",2017,6.0999999999999999E-2]
[null,"Romania","Total","15 to 74 years",2018,5.2999999999999999E-2]
[null,"Romania","Total","15 to 74 years",2019,4.9000000000000002E-2]
[null,"Romania","Total","15 to 74 years",2020,6.0999999999999999E-2]
[null,"Romania","Total","15 to 74 years",2021,5.5999999999999994E-2]
[null,"Romania","Total","15 to 74 years",2022,5.5999999999999994E-2]
[null,"Romania","Total","15 to 74 years",2023,5.5999999999999994E-2]
[null,"Romania","Total","15 to 74 years",2024,5.4000000000000006E-2]
[null,"Slovakia","Total","15 to 74 years",2010,0.14300000000000002]
[null,"Slovakia","Total","15 to 74 years",2011,0.13500000000000001]
[null,"Slovakia","Total","15 to 74 years",2012,0.13900000000000001]
[null,"Slovakia","Total","15 to 74 years",2013,0.14099999999999999]
[null,"Slovakia","Total","15 to 74 years",2014,0.13100000000000001]
[null,"Slovakia","Total","15 to 74 years",2015,0.115]
[null,"Slovakia","Total","15 to 74 years",2016,9.6000000000000002E-2]
[null,"Slovakia","Total","15 to 74 years",2017,8.1000000000000003E-2]
[null,"Slovakia","Total","15 to 74 years",2018,6.5000000000000002E-2]
[null,"Slovakia","Total","15 to 74 years",2019,5.7000000000000002E-2]
[null,"Slovakia","Total","15 to 74 years",2020,6.7000000000000004E-2]
[null,"Slovakia","Total","15 to 74 years",2021,6.8000000000000005E-2]
[null,"Slovakia","Total","15 to 74 years",2022,6.0999999999999999E-2]
[null,"Slovakia","Total","15 to 74 years",2023,5.7999999999999996E-2]
[null,"Slovakia","Total","15 to 74 years",2024,5.2999999999999999E-2]
[null,"Slovenia","Total","15 to 74 years",2010,7.2999999999999995E-2]
[null,"Slovenia","Total","15 to 74 years",2011,8.199999999999999E-2]
[null,"Slovenia","Total","15 to 74 years",2012,8.900000000000001E-2]
[null,"Slovenia","Total","15 to 74 years",2013,0.10099999999999999]
[null,"Slovenia","Total","15 to 74 years",2014,9.6999999999999989E-2]
[null,"Slovenia","Total","15 to 74 years",2015,0.09]
[null,"Slovenia","Total","15 to 74 years",2016,0.08]
[null,"Slovenia","Total","15 to 74 years",2017,6.6000000000000003E-2]
[null,"Slovenia","Total","15 to 74 years",2018,5.0999999999999997E-2]
[null,"Slovenia","Total","15 to 74 years",2019,4.4000000000000004E-2]
[null,"Slovenia","Total","15 to 74 years",2020,0.05]
[null,"Slovenia","Total","15 to 74 years",2021,4.8000000000000001E-2]
[null,"Slovenia","Total","15 to 74 years",2022,0.04]
[null,"Slovenia","Total","15 to 74 years",2023,3.7000000000000005E-2]
[null,"Slovenia","Total","15 to 74 years",2024,3.7000000000000005E-2]
[null,"Spain","Total","15 to 74 years",2010,0.19899999999999998]
[null,"Spain","Total","15 to 74 years",2011,0.214]
[null,"Spain","Total","15 to 74 years",2012,0.248]
[null,"Spain","Total","15 to 74 years",2013,0.26100000000000001]
[null,"Spain","Total","15 to 74 years",2014,0.245]
[null,"Spain","Total","15 to 74 years",2015,0.221]
[null,"Spain","Total","15 to 74 years",2016,0.19600000000000001]
[null,"Spain","Total","15 to 74 years",2017,0.17199999999999999]
[null,"Spain","Total","15 to 74 years",2018,0.153]
[null,"Spain","Total","15 to 74 years",2019,0.14099999999999999]
[null,"Spain","Total","15 to 74 years",2020,0.155]
[null,"Spain","Total","15 to 74 years",2021,0.14899999999999999]
[null,"Spain","Total","15 to 74 years",2022,0.13]
[null,"Spain","Total","15 to 74 years",2023,0.122]
[null,"Spain","Total","15 to 74 years",2024,0.114]
[null,"Sweden","Total","15 to 74 years",2010,8.6999999999999994E-2]
[null,"Sweden","Total","15 to 74 years",2011,7.9000000000000001E-2]
[null,"Sweden","Total","15 to 74 years",2012,8.1000000000000003E-2]
[null,"Sweden","Total","15 to 74 years",2013,8.1000000000000003E-2]
[null,"Sweden","Total","15 to 74 years",2014,0.08]
[null,"Sweden","Total","15 to 74 years",2015,7.4999999999999997E-2]
[null,"Sweden","Total","15 to 74 years",2016,7.0999999999999994E-2]
[null,"Sweden","Total","15 to 74 years",2017,6.8000000000000005E-2]
[null,"Sweden","Total","15 to 74 years",2018,6.5000000000000002E-2]
[null,"Sweden","Total","15 to 74 years",2019,6.9000000000000006E-2]
[null,"Sweden","Total","15 to 74 years",2020,8.5000000000000006E-2]
[null,"Sweden","Total","15 to 74 years",2021,8.900000000000001E-2]
[null,"Sweden","Total","15 to 74 years",2022,7.4999999999999997E-2]
[null,"Sweden","Total","15 to 74 years",2023,7.6999999999999999E-2]
[null,"Sweden","Total","15 to 74 years",2024,8.4000000000000005E-2]
[null,"Austria","Total","20 to 64 years",2010,4.9000000000000002E-2]
[null,"Austria","Total","20 to 64 years",2011,4.5999999999999999E-2]
[null,"Austria","Total","20 to 64 years",2012,0.05]
[null,"Austria","Total","20 to 64 years",2013,5.5E-2]
[null,"Austria","Total","20 to 64 years",2014,5.9000000000000004E-2]
[null,"Austria","Total","20 to 64 years",2015,0.06]
[null,"Austria","Total","20 to 64 years",2016,6.2E-2]
[null,"Austria","Total","20 to 64 years",2017,5.7000000000000002E-2]
[null,"Austria","Total","20 to 64 years",2018,0.05]
[null,"Austria","Total","20 to 64 years",2019,4.7E-2]
[null,"Austria","Total","20 to 64 years",2020,5.9000000000000004E-2]
[null,"Austria","Total","20 to 64 years",2021,0.06]
[null,"Austria","Total","20 to 64 years",2022,4.4999999999999998E-2]
[null,"Austria","Total","20 to 64 years",2023,4.8000000000000001E-2]
[null,"Austria","Total","20 to 64 years",2024,4.9000000000000002E-2]
[null,"Belgium","Total","20 to 64 years",2010,8.1000000000000003E-2]
[null,"Belgium","Total","20 to 64 years",2011,7.0000000000000007E-2]
[null,"Belgium","Total","20 to 64 years",2012,7.400000000000001E-2]
[null,"Belgium","Total","20 to 64 years",2013,8.4000000000000005E-2]
[null,"Belgium","Total","20 to 64 years",2014,8.5000000000000006E-2]
[null,"Belgium","Total","20 to 64 years",2015,8.5000000000000006E-2]
[null,"Belgium","Total","20 to 64 years",2016,7.8E-2]
[null,"Belgium","Total","20 to 64 years",2017,7.0999999999999994E-2]
[null,"Belgium","Total","20 to 64 years",2018,5.9000000000000004E-2]
[null,"Belgium","Total","20 to 64 years",2019,5.2999999999999999E-2]
[null,"Belgium","Total","20 to 64 years",2020,5.5999999999999994E-2]
[null,"Belgium","Total","20 to 64 years",2021,0.06]
[null,"Belgium","Total","20 to 64 years",2022,5.2999999999999999E-2]
[null,"Belgium","Total","20 to 64 years",2023,5.2999999999999999E-2]
[null,"Belgium","Total","20 to 64 years",2024,5.4000000000000006E-2]
[null,"Bulgaria","Total","20 to 64 years",2010,0.111]
[null,"Bulgaria","Total","20 to 64 years",2011,0.12]
[null,"Bulgaria","Total","20 to 64 years",2012,0.13]
[null,"Bulgaria","Total","20 to 64 years",2013,0.13699999999999998]
[null,"Bulgaria","Total","20 to 64 years",2014,0.12300000000000001]
[null,"Bulgaria","Total","20 to 64 years",2015,0.10099999999999999]
[null,"Bulgaria","Total","20 to 64 years",2016,8.5999999999999993E-2]
[null,"Bulgaria","Total","20 to 64 years",2017,7.0999999999999994E-2]
[null,"Bulgaria","Total","20 to 64 years",2018,6.2E-2]
[null,"Bulgaria","Total","20 to 64 years",2019,5.2999999999999999E-2]
[null,"Bulgaria","Total","20 to 64 years",2020,6.0999999999999999E-2]
[null,"Bulgaria","Total","20 to 64 years",2021,5.0999999999999997E-2]
[null,"Bulgaria","Total","20 to 64 years",2022,4.0999999999999995E-2]
[null,"Bulgaria","Total","20 to 64 years",2023,4.2999999999999997E-2]
[null,"Bulgaria","Total","20 to 64 years",2024,4.0999999999999995E-2]
[null,"Croatia","Total","20 to 64 years",2010,0.111]
[null,"Croatia","Total","20 to 64 years",2011,0.13200000000000001]
[null,"Croatia","Total","20 to 64 years",2012,0.156]
[null,"Croatia","Total","20 to 64 years",2013,0.16600000000000001]
[null,"Croatia","Total","20 to 64 years",2014,0.16600000000000001]
[null,"Croatia","Total","20 to 64 years",2015,0.155]
[null,"Croatia","Total","20 to 64 years",2016,0.124]
[null,"Croatia","Total","20 to 64 years",2017,0.106]
[null,"Croatia","Total","20 to 64 years",2018,8.1000000000000003E-2]
[null,"Croatia","Total","20 to 64 years",2019,6.3E-2]
[null,"Croatia","Total","20 to 64 years",2020,6.9000000000000006E-2]
[null,"Croatia","Total","20 to 64 years",2021,7.0999999999999994E-2]
[null,"Croatia","Total","20 to 64 years",2022,6.5000000000000002E-2]
[null,"Croatia","Total","20 to 64 years",2023,5.7999999999999996E-2]
[null,"Croatia","Total","20 to 64 years",2024,4.7E-2]
[null,"Cyprus","Total","20 to 64 years",2010,6.2E-2]
[null,"Cyprus","Total","20 to 64 years",2011,7.8E-2]
[null,"Cyprus","Total","20 to 64 years",2012,0.11800000000000001]
[null,"Cyprus","Total","20 to 64 years",2013,0.158]
[null,"Cyprus","Total","20 to 64 years",2014,0.16]
[null,"Cyprus","Total","20 to 64 years",2015,0.14899999999999999]
[null,"Cyprus","Total","20 to 64 years",2016,0.129]
[null,"Cyprus","Total","20 to 64 years",2017,0.111]
[null,"Cyprus","Total","20 to 64 years",2018,8.4000000000000005E-2]
[null,"Cyprus","Total","20 to 64 years",2019,7.0999999999999994E-2]
[null,"Cyprus","Total","20 to 64 years",2020,7.6999999999999999E-2]
[null,"Cyprus","Total","20 to 64 years",2021,7.2000000000000008E-2]
[null,"Cyprus","Total","20 to 64 years",2022,6.2E-2]
[null,"Cyprus","Total","20 to 64 years",2023,5.7999999999999996E-2]
[null,"Cyprus","Total","20 to 64 years",2024,4.9000000000000002E-2]
[null,"Czechia","Total","20 to 64 years",2010,7.0999999999999994E-2]
[null,"Czechia","Total","20 to 64 years",2011,6.5000000000000002E-2]
[null,"Czechia","Total","20 to 64 years",2012,6.8000000000000005E-2]
[null,"Czechia","Total","20 to 64 years",2013,6.8000000000000005E-2]
[null,"Czechia","Total","20 to 64 years",2014,0.06]
[null,"Czechia","Total","20 to 64 years",2015,0.05]
[null,"Czechia","Total","20 to 64 years",2016,3.9E-2]
[null,"Czechia","Total","20 to 64 years",2017,2.7999999999999997E-2]
[null,"Czechia","Total","20 to 64 years",2018,2.2000000000000002E-2]
[null,"Czechia","Total","20 to 64 years",2019,0.02]
[null,"Czechia","Total","20 to 64 years",2020,2.5000000000000001E-2]
[null,"Czechia","Total","20 to 64 years",2021,2.7999999999999997E-2]
[null,"Czechia","Total","20 to 64 years",2022,2.2000000000000002E-2]
[null,"Czechia","Total","20 to 64 years",2023,2.5000000000000001E-2]
[null,"Czechia","Total","20 to 64 years",2024,2.5000000000000001E-2]
[null,"Denmark","Total","20 to 64 years",2010,7.0999999999999994E-2]
[null,"Denmark","Total","20 to 64 years",2011,7.0000000000000007E-2]
[null,"Denmark","Total","20 to 64 years",2012,7.2000000000000008E-2]
[null,"Denmark","Total","20 to 64 years",2013,6.9000000000000006E-2]
[null,"Denmark","Total","20 to 64 years",2014,6.5000000000000002E-2]
[null,"Denmark","Total","20 to 64 years",2015,0.06]
[null,"Denmark","Total","20 to 64 years",2016,5.5999999999999994E-2]
[null,"Denmark","Total","20 to 64 years",2017,5.2999999999999999E-2]
[null,"Denmark","Total","20 to 64 years",2018,4.8000000000000001E-2]
[null,"Denmark","Total","20 to 64 years",2019,4.7E-2]
[null,"Denmark","Total","20 to 64 years",2020,5.2000000000000005E-2]
[null,"Denmark","Total","20 to 64 years",2021,4.7E-2]
[null,"Denmark","Total","20 to 64 years",2022,4.0999999999999995E-2]
[null,"Denmark","Total","20 to 64 years",2023,4.7E-2]
[null,"Denmark","Total","20 to 64 years",2024,5.5E-2]
[null,"Estonia","Total","20 to 64 years",2010,0.16500000000000001]
[null,"Estonia","Total","20 to 64 years",2011,0.121]
[null,"Estonia","Total","20 to 64 years",2012,9.8000000000000004E-2]
[null,"Estonia","Total","20 to 64 years",2013,8.5999999999999993E-2]
[null,"Estonia","Total","20 to 64 years",2014,7.2999999999999995E-2]
[null,"Estonia","Total","20 to 64 years",2015,6.3E-2]
[null,"Estonia","Total","20 to 64 years",2016,6.8000000000000005E-2]
[null,"Estonia","Total","20 to 64 years",2017,5.7000000000000002E-2]
[null,"Estonia","Total","20 to 64 years",2018,5.2000000000000005E-2]
[null,"Estonia","Total","20 to 64 years",2019,4.4000000000000004E-2]
[null,"Estonia","Total","20 to 64 years",2020,6.8000000000000005E-2]
[null,"Estonia","Total","20 to 64 years",2021,6.0999999999999999E-2]
[null,"Estonia","Total","20 to 64 years",2022,5.5E-2]
[null,"Estonia","Total","20 to 64 years",2023,6.2E-2]
[null,"Estonia","Total","20 to 64 years",2024,7.400000000000001E-2]
[null,"Finland","Total","20 to 64 years",2010,7.8E-2]
[null,"Finland","Total","20 to 64 years",2011,7.2999999999999995E-2]
[null,"Finland","Total","20 to 64 years",2012,7.0999999999999994E-2]
[null,"Finland","Total","20 to 64 years",2013,7.5999999999999998E-2]
[null,"Finland","Total","20 to 64 years",2014,8.1000000000000003E-2]
[null,"Finland","Total","20 to 64 years",2015,8.900000000000001E-2]
[null,"Finland","Total","20 to 64 years",2016,8.3000000000000004E-2]
[null,"Finland","Total","20 to 64 years",2017,8.1000000000000003E-2]
[null,"Finland","Total","20 to 64 years",2018,6.9000000000000006E-2]
[null,"Finland","Total","20 to 64 years",2019,6.0999999999999999E-2]
[null,"Finland","Total","20 to 64 years",2020,7.0999999999999994E-2]
[null,"Finland","Total","20 to 64 years",2021,7.0999999999999994E-2]
[null,"Finland","Total","20 to 64 years",2022,6.3E-2]
[null,"Finland","Total","20 to 64 years",2023,6.6000000000000003E-2]
[null,"Finland","Total","20 to 64 years",2024,7.8E-2]
[null,"France","Total","20 to 64 years",2010,8.6999999999999994E-2]
[null,"France","Total","20 to 64 years",2011,8.6999999999999994E-2]
[null,"France","Total","20 to 64 years",2012,9.3000000000000013E-2]
[null,"France","Total","20 to 64 years",2013,9.8000000000000004E-2]
[null,"France","Total","20 to 64 years",2014,9.8000000000000004E-2]
[null,"France","Total","20 to 64 years",2015,9.9000000000000005E-2]
[null,"France","Total","20 to 64 years",2016,9.6000000000000002E-2]
[null,"France","Total","20 to 64 years",2017,0.09]
[null,"France","Total","20 to 64 years",2018,8.6999999999999994E-2]
[null,"France","Total","20 to 64 years",2019,8.1000000000000003E-2]
[null,"France","Total","20 to 64 years",2020,7.5999999999999998E-2]
[null,"France","Total","20 to 64 years",2021,7.4999999999999997E-2]
[null,"France","Total","20 to 64 years",2022,6.9000000000000006E-2]
[null,"France","Total","20 to 64 years",2023,7.0000000000000007E-2]
[null,"France","Total","20 to 64 years",2024,7.0000000000000007E-2]
[null,"Germany","Total","20 to 64 years",2010,6.5000000000000002E-2]
[null,"Germany","Total","20 to 64 years",2011,5.4000000000000006E-2]
[null,"Germany","Total","20 to 64 years",2012,0.05]
[null,"Germany","Total","20 to 64 years",2013,4.9000000000000002E-2]
[null,"Germany","Total","20 to 64 years",2014,4.7E-2]
[null,"Germany","Total","20 to 64 years",2015,4.2999999999999997E-2]
[null,"Germany","Total","20 to 64 years",2016,3.7999999999999999E-2]
[null,"Germany","Total","20 to 64 years",2017,3.5000000000000003E-2]
[null,"Germany","Total","20 to 64 years",2018,3.1E-2]
[null,"Germany","Total","20 to 64 years",2019,2.8999999999999998E-2]
[null,"Germany","Total","20 to 64 years",2020,3.5000000000000003E-2]
[null,"Germany","Total","20 to 64 years",2021,3.5000000000000003E-2]
[null,"Germany","Total","20 to 64 years",2022,3.1E-2]
[null,"Germany","Total","20 to 64 years",2023,0.03]
[null,"Germany","Total","20 to 64 years",2024,3.3000000000000002E-2]
[null,"Greece","Total","20 to 64 years",2010,0.129]
[null,"Greece","Total","20 to 64 years",2011,0.18]
[null,"Greece","Total","20 to 64 years",2012,0.24600000000000002]
[null,"Greece","Total","20 to 64 years",2013,0.27600000000000002]
[null,"Greece","Total","20 to 64 years",2014,0.26500000000000001]
[null,"Greece","Total","20 to 64 years",2015,0.249]
[null,"Greece","Total","20 to 64 years",2016,0.23800000000000002]
[null,"Greece","Total","20 to 64 years",2017,0.218]
[null,"Greece","Total","20 to 64 years",2018,0.19699999999999998]
[null,"Greece","Total","20 to 64 years",2019,0.17899999999999999]
[null,"Greece","Total","20 to 64 years",2020,0.17699999999999999]
[null,"Greece","Total","20 to 64 years",2021,0.14699999999999999]
[null,"Greece","Total","20 to 64 years",2022,0.12300000000000001]
[null,"Greece","Total","20 to 64 years",2023,0.11]
[null,"Greece","Total","20 to 64 years",2024,0.1]
[null,"Hungary","Total","20 to 64 years",2010,0.107]
[null,"Hungary","Total","20 to 64 years",2011,0.106]
[null,"Hungary","Total","20 to 64 years",2012,0.105]
[null,"Hungary","Total","20 to 64 years",2013,9.6999999999999989E-2]
[null,"Hungary","Total","20 to 64 years",2014,7.400000000000001E-2]
[null,"Hungary","Total","20 to 64 years",2015,6.5000000000000002E-2]
[null,"Hungary","Total","20 to 64 years",2016,4.8000000000000001E-2]
[null,"Hungary","Total","20 to 64 years",2017,3.9E-2]
[null,"Hungary","Total","20 to 64 years",2018,3.5000000000000003E-2]
[null,"Hungary","Total","20 to 64 years",2019,3.2000000000000001E-2]
[null,"Hungary","Total","20 to 64 years",2020,0.04]
[null,"Hungary","Total","20 to 64 years",2021,3.9E-2]
[null,"Hungary","Total","20 to 64 years",2022,3.5000000000000003E-2]
[null,"Hungary","Total","20 to 64 years",2023,0.04]
[null,"Hungary","Total","20 to 64 years",2024,4.2999999999999997E-2]
[null,"Ireland","Total","20 to 64 years",2010,0.14000000000000001]
[null,"Ireland","Total","20 to 64 years",2011,0.14899999999999999]
[null,"Ireland","Total","20 to 64 years",2012,0.14899999999999999]
[null,"Ireland","Total","20 to 64 years",2013,0.13300000000000001]
[null,"Ireland","Total","20 to 64 years",2014,0.115]
[null,"Ireland","Total","20 to 64 years",2015,9.6000000000000002E-2]
[null,"Ireland","Total","20 to 64 years",2016,8.1000000000000003E-2]
[null,"Ireland","Total","20 to 64 years",2017,6.4000000000000001E-2]
[null,"Ireland","Total","20 to 64 years",2018,5.4000000000000006E-2]
[null,"Ireland","Total","20 to 64 years",2019,4.5999999999999999E-2]
[null,"Ireland","Total","20 to 64 years",2020,5.5E-2]
[null,"Ireland","Total","20 to 64 years",2021,5.7000000000000002E-2]
[null,"Ireland","Total","20 to 64 years",2022,4.0999999999999995E-2]
[null,"Ireland","Total","20 to 64 years",2023,3.9E-2]
[null,"Ireland","Total","20 to 64 years",2024,3.9E-2]
[null,"Italy","Total","20 to 64 years",2010,8.199999999999999E-2]
[null,"Italy","Total","20 to 64 years",2011,8.3000000000000004E-2]
[null,"Italy","Total","20 to 64 years",2012,0.106]
[null,"Italy","Total","20 to 64 years",2013,0.121]
[null,"Italy","Total","20 to 64 years",2014,0.126]
[null,"Italy","Total","20 to 64 years",2015,0.11800000000000001]
[null,"Italy","Total","20 to 64 years",2016,0.11599999999999999]
[null,"Italy","Total","20 to 64 years",2017,0.111]
[null,"Italy","Total","20 to 64 years",2018,0.10400000000000001]
[null,"Italy","Total","20 to 64 years",2019,9.8000000000000004E-2]
[null,"Italy","Total","20 to 64 years",2020,9.3000000000000013E-2]
[null,"Italy","Total","20 to 64 years",2021,9.4E-2]
[null,"Italy","Total","20 to 64 years",2022,0.08]
[null,"Italy","Total","20 to 64 years",2023,7.5999999999999998E-2]
[null,"Italy","Total","20 to 64 years",2024,6.4000000000000001E-2]
[null,"Latvia","Total","20 to 64 years",2010,0.19399999999999998]
[null,"Latvia","Total","20 to 64 years",2011,0.16200000000000001]
[null,"Latvia","Total","20 to 64 years",2012,0.15]
[null,"Latvia","Total","20 to 64 years",2013,0.11900000000000001]
[null,"Latvia","Total","20 to 64 years",2014,0.11]
[null,"Latvia","Total","20 to 64 years",2015,9.9000000000000005E-2]
[null,"Latvia","Total","20 to 64 years",2016,9.9000000000000005E-2]
[null,"Latvia","Total","20 to 64 years",2017,8.8000000000000009E-2]
[null,"Latvia","Total","20 to 64 years",2018,7.5999999999999998E-2]
[null,"Latvia","Total","20 to 64 years",2019,6.4000000000000001E-2]
[null,"Latvia","Total","20 to 64 years",2020,8.3000000000000004E-2]
[null,"Latvia","Total","20 to 64 years",2021,7.6999999999999999E-2]
[null,"Latvia","Total","20 to 64 years",2022,6.9000000000000006E-2]
[null,"Latvia","Total","20 to 64 years",2023,6.7000000000000004E-2]
[null,"Latvia","Total","20 to 64 years",2024,7.0999999999999994E-2]
[null,"Lithuania","Total","20 to 64 years",2010,0.17800000000000002]
[null,"Lithuania","Total","20 to 64 years",2011,0.154]
[null,"Lithuania","Total","20 to 64 years",2012,0.13500000000000001]
[null,"Lithuania","Total","20 to 64 years",2013,0.11900000000000001]
[null,"Lithuania","Total","20 to 64 years",2014,0.10800000000000001]
[null,"Lithuania","Total","20 to 64 years",2015,9.1999999999999998E-2]
[null,"Lithuania","Total","20 to 64 years",2016,0.08]
[null,"Lithuania","Total","20 to 64 years",2017,7.2000000000000008E-2]
[null,"Lithuania","Total","20 to 64 years",2018,6.3E-2]
[null,"Lithuania","Total","20 to 64 years",2019,6.4000000000000001E-2]
[null,"Lithuania","Total","20 to 64 years",2020,8.6999999999999994E-2]
[null,"Lithuania","Total","20 to 64 years",2021,7.2999999999999995E-2]
[null,"Lithuania","Total","20 to 64 years",2022,6.0999999999999999E-2]
[null,"Lithuania","Total","20 to 64 years",2023,7.0000000000000007E-2]
[null,"Lithuania","Total","20 to 64 years",2024,7.2000000000000008E-2]
[null,"Luxembourg","Total","20 to 64 years",2010,4.2000000000000003E-2]
[null,"Luxembourg","Total","20 to 64 years",2011,4.8000000000000001E-2]
[null,"Luxembourg","Total","20 to 64 years",2012,0.05]
[null,"Luxembourg","Total","20 to 64 years",2013,5.7000000000000002E-2]
[null,"Luxembourg","Total","20 to 64 years",2014,5.5999999999999994E-2]
[null,"Luxembourg","Total","20 to 64 years",2015,6.3E-2]
[null,"Luxembourg","Total","20 to 64 years",2016,5.9000000000000004E-2]
[null,"Luxembourg","Total","20 to 64 years",2017,5.2999999999999999E-2]
[null,"Luxembourg","Total","20 to 64 years",2018,5.2999999999999999E-2]
[null,"Luxembourg","Total","20 to 64 years",2019,5.2999999999999999E-2]
[null,"Luxembourg","Total","20 to 64 years",2020,6.5000000000000002E-2]
[null,"Luxembourg","Total","20 to 64 years",2021,4.8000000000000001E-2]
[null,"Luxembourg","Total","20 to 64 years",2022,4.0999999999999995E-2]
[null,"Luxembourg","Total","20 to 64 years",2023,4.5999999999999999E-2]
[null,"Luxembourg","Total","20 to 64 years",2024,5.7999999999999996E-2]
[null,"Malta","Total","20 to 64 years",2010,0.06]
[null,"Malta","Total","20 to 64 years",2011,5.5999999999999994E-2]
[null,"Malta","Total","20 to 64 years",2012,5.2999999999999999E-2]
[null,"Malta","Total","20 to 64 years",2013,5.5E-2]
[null,"Malta","Total","20 to 64 years",2014,5.2999999999999999E-2]
[null,"Malta","Total","20 to 64 years",2015,4.9000000000000002E-2]
[null,"Malta","Total","20 to 64 years",2016,4.2999999999999997E-2]
[null,"Malta","Total","20 to 64 years",2017,3.6000000000000004E-2]
[null,"Malta","Total","20 to 64 years",2018,3.6000000000000004E-2]
[null,"Malta","Total","20 to 64 years",2019,3.7999999999999999E-2]
[null,"Malta","Total","20 to 64 years",2020,4.7E-2]
[null,"Malta","Total","20 to 64 years",2021,3.5000000000000003E-2]
[null,"Malta","Total","20 to 64 years",2022,3.2000000000000001E-2]
[null,"Malta","Total","20 to 64 years",2023,3.2000000000000001E-2]
[null,"Malta","Total","20 to 64 years",2024,2.8999999999999998E-2]
[null,"Netherlands","Total","20 to 64 years",2010,5.2999999999999999E-2]
[null,"Netherlands","Total","20 to 64 years",2011,5.2999999999999999E-2]
[null,"Netherlands","Total","20 to 64 years",2012,0.06]
[null,"Netherlands","Total","20 to 64 years",2013,7.4999999999999997E-2]
[null,"Netherlands","Total","20 to 64 years",2014,7.6999999999999999E-2]
[null,"Netherlands","Total","20 to 64 years",2015,7.2000000000000008E-2]
[null,"Netherlands","Total","20 to 64 years",2016,6.3E-2]
[null,"Netherlands","Total","20 to 64 years",2017,5.2000000000000005E-2]
[null,"Netherlands","Total","20 to 64 years",2018,4.2999999999999997E-2]
[null,"Netherlands","Total","20 to 64 years",2019,3.9E-2]
[null,"Netherlands","Total","20 to 64 years",2020,4.2000000000000003E-2]
[null,"Netherlands","Total","20 to 64 years",2021,3.5000000000000003E-2]
[null,"Netherlands","Total","20 to 64 years",2022,2.8999999999999998E-2]
[null,"Netherlands","Total","20 to 64 years",2023,2.8999999999999998E-2]
[null,"Netherlands","Total","20 to 64 years",2024,0.03]
[null,"Poland","Total","20 to 64 years",2010,9.8000000000000004E-2]
[null,"Poland","Total","20 to 64 years",2011,9.8000000000000004E-2]
[null,"Poland","Total","20 to 64 years",2012,0.10199999999999999]
[null,"Poland","Total","20 to 64 years",2013,0.105]
[null,"Poland","Total","20 to 64 years",2014,9.0999999999999998E-2]
[null,"Poland","Total","20 to 64 years",2015,7.5999999999999998E-2]
[null,"Poland","Total","20 to 64 years",2016,6.0999999999999999E-2]
[null,"Poland","Total","20 to 64 years",2017,4.9000000000000002E-2]
[null,"Poland","Total","20 to 64 years",2018,3.9E-2]
[null,"Poland","Total","20 to 64 years",2019,3.2000000000000001E-2]
[null,"Poland","Total","20 to 64 years",2020,3.2000000000000001E-2]
[null,"Poland","Total","20 to 64 years",2021,3.4000000000000002E-2]
[null,"Poland","Total","20 to 64 years",2022,2.7999999999999997E-2]
[null,"Poland","Total","20 to 64 years",2023,2.7999999999999997E-2]
[null,"Poland","Total","20 to 64 years",2024,2.7999999999999997E-2]
[null,"Portugal","Total","20 to 64 years",2010,0.121]
[null,"Portugal","Total","20 to 64 years",2011,0.13200000000000001]
[null,"Portugal","Total","20 to 64 years",2012,0.16200000000000001]
[null,"Portugal","Total","20 to 64 years",2013,0.17]
[null,"Portugal","Total","20 to 64 years",2014,0.14300000000000002]
[null,"Portugal","Total","20 to 64 years",2015,0.127]
[null,"Portugal","Total","20 to 64 years",2016,0.114]
[null,"Portugal","Total","20 to 64 years",2017,0.09]
[null,"Portugal","Total","20 to 64 years",2018,7.0000000000000007E-2]
[null,"Portugal","Total","20 to 64 years",2019,6.5000000000000002E-2]
[null,"Portugal","Total","20 to 64 years",2020,7.0000000000000007E-2]
[null,"Portugal","Total","20 to 64 years",2021,6.7000000000000004E-2]
[null,"Portugal","Total","20 to 64 years",2022,6.0999999999999999E-2]
[null,"Portugal","Total","20 to 64 years",2023,6.4000000000000001E-2]
[null,"Portugal","Total","20 to 64 years",2024,6.3E-2]
[null,"Romania","Total","20 to 64 years",2010,8.8000000000000009E-2]
[null,"Romania","Total","20 to 64 years",2011,8.8000000000000009E-2]
[null,"Romania","Total","20 to 64 years",2012,8.4000000000000005E-2]
[null,"Romania","Total","20 to 64 years",2013,8.6999999999999994E-2]
[null,"Romania","Total","20 to 64 years",2014,8.3000000000000004E-2]
[null,"Romania","Total","20 to 64 years",2015,8.1000000000000003E-2]
[null,"Romania","Total","20 to 64 years",2016,6.8000000000000005E-2]
[null,"Romania","Total","20 to 64 years",2017,5.7999999999999996E-2]
[null,"Romania","Total","20 to 64 years",2018,4.9000000000000002E-2]
[null,"Romania","Total","20 to 64 years",2019,4.4999999999999998E-2]
[null,"Romania","Total","20 to 64 years",2020,5.7000000000000002E-2]
[null,"Romania","Total","20 to 64 years",2021,5.2999999999999999E-2]
[null,"Romania","Total","20 to 64 years",2022,5.2000000000000005E-2]
[null,"Romania","Total","20 to 64 years",2023,5.2000000000000005E-2]
[null,"Romania","Total","20 to 64 years",2024,4.9000000000000002E-2]
[null,"Slovakia","Total","20 to 64 years",2010,0.13900000000000001]
[null,"Slovakia","Total","20 to 64 years",2011,0.13100000000000001]
[null,"Slovakia","Total","20 to 64 years",2012,0.13500000000000001]
[null,"Slovakia","Total","20 to 64 years",2013,0.13800000000000001]
[null,"Slovakia","Total","20 to 64 years",2014,0.128]
[null,"Slovakia","Total","20 to 64 years",2015,0.11199999999999999]
[null,"Slovakia","Total","20 to 64 years",2016,9.4E-2]
[null,"Slovakia","Total","20 to 64 years",2017,7.9000000000000001E-2]
[null,"Slovakia","Total","20 to 64 years",2018,6.3E-2]
[null,"Slovakia","Total","20 to 64 years",2019,5.5999999999999994E-2]
[null,"Slovakia","Total","20 to 64 years",2020,6.5000000000000002E-2]
[null,"Slovakia","Total","20 to 64 years",2021,6.7000000000000004E-2]
[null,"Slovakia","Total","20 to 64 years",2022,0.06]
[null,"Slovakia","Total","20 to 64 years",2023,5.7000000000000002E-2]
[null,"Slovakia","Total","20 to 64 years",2024,5.0999999999999997E-2]
[null,"Slovenia","Total","20 to 64 years",2010,7.2999999999999995E-2]
[null,"Slovenia","Total","20 to 64 years",2011,8.199999999999999E-2]
[null,"Slovenia","Total","20 to 64 years",2012,8.900000000000001E-2]
[null,"Slovenia","Total","20 to 64 years",2013,0.10199999999999999]
[null,"Slovenia","Total","20 to 64 years",2014,9.8000000000000004E-2]
[null,"Slovenia","Total","20 to 64 years",2015,0.09]
[null,"Slovenia","Total","20 to 64 years",2016,8.1000000000000003E-2]
[null,"Slovenia","Total","20 to 64 years",2017,6.6000000000000003E-2]
[null,"Slovenia","Total","20 to 64 years",2018,5.2000000000000005E-2]
[null,"Slovenia","Total","20 to 64 years",2019,4.4000000000000004E-2]
[null,"Slovenia","Total","20 to 64 years",2020,0.05]
[null,"Slovenia","Total","20 to 64 years",2021,4.5999999999999999E-2]
[null,"Slovenia","Total","20 to 64 years",2022,3.9E-2]
[null,"Slovenia","Total","20 to 64 years",2023,3.4000000000000002E-2]
[null,"Slovenia","Total","20 to 64 years",2024,3.3000000000000002E-2]
[null,"Spain","Total","20 to 64 years",2010,0.193]
[null,"Spain","Total","20 to 64 years",2011,0.20899999999999999]
[null,"Spain","Total","20 to 64 years",2012,0.24299999999999999]
[null,"Spain","Total","20 to 64 years",2013,0.25600000000000001]
[null,"Spain","Total","20 to 64 years",2014,0.24100000000000002]
[null,"Spain","Total","20 to 64 years",2015,0.217]
[null,"Spain","Total","20 to 64 years",2016,0.193]
[null,"Spain","Total","20 to 64 years",2017,0.16899999999999998]
[null,"Spain","Total","20 to 64 years",2018,0.14899999999999999]
[null,"Spain","Total","20 to 64 years",2019,0.13800000000000001]
[null,"Spain","Total","20 to 64 years",2020,0.152]
[null,"Spain","Total","20 to 64 years",2021,0.14599999999999999]
[null,"Spain","Total","20 to 64 years",2022,0.127]
[null,"Spain","Total","20 to 64 years",2023,0.11900000000000001]
[null,"Spain","Total","20 to 64 years",2024,0.11]
[null,"Sweden","Total","20 to 64 years",2010,7.6999999999999999E-2]
[null,"Sweden","Total","20 to 64 years",2011,7.0000000000000007E-2]
[null,"Sweden","Total","20 to 64 years",2012,7.2000000000000008E-2]
[null,"Sweden","Total","20 to 64 years",2013,7.2999999999999995E-2]
[null,"Sweden","Total","20 to 64 years",2014,7.2000000000000008E-2]
[null,"Sweden","Total","20 to 64 years",2015,6.8000000000000005E-2]
[null,"Sweden","Total","20 to 64 years",2016,6.4000000000000001E-2]
[null,"Sweden","Total","20 to 64 years",2017,6.0999999999999999E-2]
[null,"Sweden","Total","20 to 64 years",2018,5.7999999999999996E-2]
[null,"Sweden","Total","20 to 64 years",2019,6.0999999999999999E-2]
[null,"Sweden","Total","20 to 64 years",2020,7.6999999999999999E-2]
[null,"Sweden","Total","20 to 64 years",2021,7.9000000000000001E-2]
[null,"Sweden","Total","20 to 64 years",2022,6.3E-2]
[null,"Sweden","Total","20 to 64 years",2023,6.5000000000000002E-2]
[null,"Sweden","Total","20 to 64 years",2024,7.0999999999999994E-2]
[null,"Austria","Total","25 to 54 years",2010,4.7E-2]
[null,"Austria","Total","25 to 54 years",2011,4.2999999999999997E-2]
[null,"Austria","Total","25 to 54 years",2012,4.5999999999999999E-2]
[null,"Austria","Total","25 to 54 years",2013,5.2999999999999999E-2]
[null,"Austria","Total","25 to 54 years",2014,5.5999999999999994E-2]
[null,"Austria","Total","25 to 54 years",2015,5.5E-2]
[null,"Austria","Total","25 to 54 years",2016,5.7999999999999996E-2]
[null,"Austria","Total","25 to 54 years",2017,5.5E-2]
[null,"Austria","Total","25 to 54 years",2018,4.7E-2]
[null,"Austria","Total","25 to 54 years",2019,4.4999999999999998E-2]
[null,"Austria","Total","25 to 54 years",2020,5.5999999999999994E-2]
[null,"Austria","Total","25 to 54 years",2021,5.7999999999999996E-2]
[null,"Austria","Total","25 to 54 years",2022,4.2999999999999997E-2]
[null,"Austria","Total","25 to 54 years",2023,4.5999999999999999E-2]
[null,"Austria","Total","25 to 54 years",2024,4.8000000000000001E-2]
[null,"Belgium","Total","25 to 54 years",2010,7.400000000000001E-2]
[null,"Belgium","Total","25 to 54 years",2011,6.4000000000000001E-2]
[null,"Belgium","Total","25 to 54 years",2012,6.8000000000000005E-2]
[null,"Belgium","Total","25 to 54 years",2013,7.4999999999999997E-2]
[null,"Belgium","Total","25 to 54 years",2014,7.6999999999999999E-2]
[null,"Belgium","Total","25 to 54 years",2015,7.8E-2]
[null,"Belgium","Total","25 to 54 years",2016,7.2000000000000008E-2]
[null,"Belgium","Total","25 to 54 years",2017,6.3E-2]
[null,"Belgium","Total","25 to 54 years",2018,5.4000000000000006E-2]
[null,"Belgium","Total","25 to 54 years",2019,4.8000000000000001E-2]
[null,"Belgium","Total","25 to 54 years",2020,5.2000000000000005E-2]
[null,"Belgium","Total","25 to 54 years",2021,5.5E-2]
[null,"Belgium","Total","25 to 54 years",2022,4.9000000000000002E-2]
[null,"Belgium","Total","25 to 54 years",2023,4.9000000000000002E-2]
[null,"Belgium","Total","25 to 54 years",2024,0.05]
[null,"Bulgaria","Total","25 to 54 years",2010,0.10400000000000001]
[null,"Bulgaria","Total","25 to 54 years",2011,0.115]
[null,"Bulgaria","Total","25 to 54 years",2012,0.122]
[null,"Bulgaria","Total","25 to 54 years",2013,0.128]
[null,"Bulgaria","Total","25 to 54 years",2014,0.115]
[null,"Bulgaria","Total","25 to 54 years",2015,9.4E-2]
[null,"Bulgaria","Total","25 to 54 years",2016,8.1000000000000003E-2]
[null,"Bulgaria","Total","25 to 54 years",2017,6.9000000000000006E-2]
[null,"Bulgaria","Total","25 to 54 years",2018,0.06]
[null,"Bulgaria","Total","25 to 54 years",2019,5.2000000000000005E-2]
[null,"Bulgaria","Total","25 to 54 years",2020,0.06]
[null,"Bulgaria","Total","25 to 54 years",2021,0.05]
[null,"Bulgaria","Total","25 to 54 years",2022,4.0999999999999995E-2]
[null,"Bulgaria","Total","25 to 54 years",2023,4.2000000000000003E-2]
[null,"Bulgaria","Total","25 to 54 years",2024,4.0999999999999995E-2]
[null,"Croatia","Total","25 to 54 years",2010,0.10199999999999999]
[null,"Croatia","Total","25 to 54 years",2011,0.124]
[null,"Croatia","Total","25 to 54 years",2012,0.14699999999999999]
[null,"Croatia","Total","25 to 54 years",2013,0.155]
[null,"Croatia","Total","25 to 54 years",2014,0.153]
[null,"Croatia","Total","25 to 54 years",2015,0.14499999999999999]
[null,"Croatia","Total","25 to 54 years",2016,0.11699999999999999]
[null,"Croatia","Total","25 to 54 years",2017,0.1]
[null,"Croatia","Total","25 to 54 years",2018,7.5999999999999998E-2]
[null,"Croatia","Total","25 to 54 years",2019,6.2E-2]
[null,"Croatia","Total","25 to 54 years",2020,6.7000000000000004E-2]
[null,"Croatia","Total","25 to 54 years",2021,6.8000000000000005E-2]
[null,"Croatia","Total","25 to 54 years",2022,6.2E-2]
[null,"Croatia","Total","25 to 54 years",2023,5.4000000000000006E-2]
[null,"Croatia","Total","25 to 54 years",2024,4.4000000000000004E-2]
[null,"Cyprus","Total","25 to 54 years",2010,5.4000000000000006E-2]
[null,"Cyprus","Total","25 to 54 years",2011,6.8000000000000005E-2]
[null,"Cyprus","Total","25 to 54 years",2012,0.105]
[null,"Cyprus","Total","25 to 54 years",2013,0.13900000000000001]
[null,"Cyprus","Total","25 to 54 years",2014,0.13900000000000001]
[null,"Cyprus","Total","25 to 54 years",2015,0.13100000000000001]
[null,"Cyprus","Total","25 to 54 years",2016,0.11699999999999999]
[null,"Cyprus","Total","25 to 54 years",2017,0.10400000000000001]
[null,"Cyprus","Total","25 to 54 years",2018,7.8E-2]
[null,"Cyprus","Total","25 to 54 years",2019,6.6000000000000003E-2]
[null,"Cyprus","Total","25 to 54 years",2020,7.2999999999999995E-2]
[null,"Cyprus","Total","25 to 54 years",2021,6.8000000000000005E-2]
[null,"Cyprus","Total","25 to 54 years",2022,5.7000000000000002E-2]
[null,"Cyprus","Total","25 to 54 years",2023,5.2999999999999999E-2]
[null,"Cyprus","Total","25 to 54 years",2024,4.7E-2]
[null,"Czechia","Total","25 to 54 years",2010,6.4000000000000001E-2]
[null,"Czechia","Total","25 to 54 years",2011,5.9000000000000004E-2]
[null,"Czechia","Total","25 to 54 years",2012,6.0999999999999999E-2]
[null,"Czechia","Total","25 to 54 years",2013,6.2E-2]
[null,"Czechia","Total","25 to 54 years",2014,5.5999999999999994E-2]
[null,"Czechia","Total","25 to 54 years",2015,4.5999999999999999E-2]
[null,"Czechia","Total","25 to 54 years",2016,3.5000000000000003E-2]
[null,"Czechia","Total","25 to 54 years",2017,2.7000000000000003E-2]
[null,"Czechia","Total","25 to 54 years",2018,0.02]
[null,"Czechia","Total","25 to 54 years",2019,1.8000000000000002E-2]
[null,"Czechia","Total","25 to 54 years",2020,2.4E-2]
[null,"Czechia","Total","25 to 54 years",2021,2.6000000000000002E-2]
[null,"Czechia","Total","25 to 54 years",2022,0.02]
[null,"Czechia","Total","25 to 54 years",2023,2.3E-2]
[null,"Czechia","Total","25 to 54 years",2024,2.3E-2]
[null,"Denmark","Total","25 to 54 years",2010,6.7000000000000004E-2]
[null,"Denmark","Total","25 to 54 years",2011,6.5000000000000002E-2]
[null,"Denmark","Total","25 to 54 years",2012,6.8000000000000005E-2]
[null,"Denmark","Total","25 to 54 years",2013,6.5000000000000002E-2]
[null,"Denmark","Total","25 to 54 years",2014,0.06]
[null,"Denmark","Total","25 to 54 years",2015,5.7000000000000002E-2]
[null,"Denmark","Total","25 to 54 years",2016,5.2999999999999999E-2]
[null,"Denmark","Total","25 to 54 years",2017,5.0999999999999997E-2]
[null,"Denmark","Total","25 to 54 years",2018,4.4999999999999998E-2]
[null,"Denmark","Total","25 to 54 years",2019,4.4999999999999998E-2]
[null,"Denmark","Total","25 to 54 years",2020,4.9000000000000002E-2]
[null,"Denmark","Total","25 to 54 years",2021,4.2000000000000003E-2]
[null,"Denmark","Total","25 to 54 years",2022,3.6000000000000004E-2]
[null,"Denmark","Total","25 to 54 years",2023,4.4000000000000004E-2]
[null,"Denmark","Total","25 to 54 years",2024,0.05]
[null,"Estonia","Total","25 to 54 years",2010,0.15]
[null,"Estonia","Total","25 to 54 years",2011,0.114]
[null,"Estonia","Total","25 to 54 years",2012,9.4E-2]
[null,"Estonia","Total","25 to 54 years",2013,8.199999999999999E-2]
[null,"Estonia","Total","25 to 54 years",2014,7.0999999999999994E-2]
[null,"Estonia","Total","25 to 54 years",2015,5.5999999999999994E-2]
[null,"Estonia","Total","25 to 54 years",2016,5.9000000000000004E-2]
[null,"Estonia","Total","25 to 54 years",2017,5.2000000000000005E-2]
[null,"Estonia","Total","25 to 54 years",2018,4.7E-2]
[null,"Estonia","Total","25 to 54 years",2019,0.04]
[null,"Estonia","Total","25 to 54 years",2020,0.06]
[null,"Estonia","Total","25 to 54 years",2021,5.4000000000000006E-2]
[null,"Estonia","Total","25 to 54 years",2022,4.7E-2]
[null,"Estonia","Total","25 to 54 years",2023,5.5999999999999994E-2]
[null,"Estonia","Total","25 to 54 years",2024,6.9000000000000006E-2]
[null,"Finland","Total","25 to 54 years",2010,6.9000000000000006E-2]
[null,"Finland","Total","25 to 54 years",2011,6.3E-2]
[null,"Finland","Total","25 to 54 years",2012,6.3E-2]
[null,"Finland","Total","25 to 54 years",2013,6.7000000000000004E-2]
[null,"Finland","Total","25 to 54 years",2014,7.2000000000000008E-2]
[null,"Finland","Total","25 to 54 years",2015,7.8E-2]
[null,"Finland","Total","25 to 54 years",2016,7.4999999999999997E-2]
[null,"Finland","Total","25 to 54 years",2017,7.0999999999999994E-2]
[null,"Finland","Total","25 to 54 years",2018,6.0999999999999999E-2]
[null,"Finland","Total","25 to 54 years",2019,5.0999999999999997E-2]
[null,"Finland","Total","25 to 54 years",2020,5.7999999999999996E-2]
[null,"Finland","Total","25 to 54 years",2021,6.4000000000000001E-2]
[null,"Finland","Total","25 to 54 years",2022,5.5E-2]
[null,"Finland","Total","25 to 54 years",2023,5.7999999999999996E-2]
[null,"Finland","Total","25 to 54 years",2024,7.0000000000000007E-2]
[null,"France","Total","25 to 54 years",2010,7.8E-2]
[null,"France","Total","25 to 54 years",2011,7.9000000000000001E-2]
[null,"France","Total","25 to 54 years",2012,8.4000000000000005E-2]
[null,"France","Total","25 to 54 years",2013,8.900000000000001E-2]
[null,"France","Total","25 to 54 years",2014,0.09]
[null,"France","Total","25 to 54 years",2015,0.09]
[null,"France","Total","25 to 54 years",2016,8.6999999999999994E-2]
[null,"France","Total","25 to 54 years",2017,8.3000000000000004E-2]
[null,"France","Total","25 to 54 years",2018,7.9000000000000001E-2]
[null,"France","Total","25 to 54 years",2019,7.2999999999999995E-2]
[null,"France","Total","25 to 54 years",2020,6.9000000000000006E-2]
[null,"France","Total","25 to 54 years",2021,6.8000000000000005E-2]
[null,"France","Total","25 to 54 years",2022,6.2E-2]
[null,"France","Total","25 to 54 years",2023,6.4000000000000001E-2]
[null,"France","Total","25 to 54 years",2024,6.3E-2]
[null,"Germany","Total","25 to 54 years",2010,0.06]
[null,"Germany","Total","25 to 54 years",2011,0.05]
[null,"Germany","Total","25 to 54 years",2012,4.5999999999999999E-2]
[null,"Germany","Total","25 to 54 years",2013,4.4999999999999998E-2]
[null,"Germany","Total","25 to 54 years",2014,4.2999999999999997E-2]
[null,"Germany","Total","25 to 54 years",2015,0.04]
[null,"Germany","Total","25 to 54 years",2016,3.6000000000000004E-2]
[null,"Germany","Total","25 to 54 years",2017,3.2000000000000001E-2]
[null,"Germany","Total","25 to 54 years",2018,2.8999999999999998E-2]
[null,"Germany","Total","25 to 54 years",2019,2.7000000000000003E-2]
[null,"Germany","Total","25 to 54 years",2020,3.3000000000000002E-2]
[null,"Germany","Total","25 to 54 years",2021,3.4000000000000002E-2]
[null,"Germany","Total","25 to 54 years",2022,0.03]
[null,"Germany","Total","25 to 54 years",2023,0.03]
[null,"Germany","Total","25 to 54 years",2024,3.4000000000000002E-2]
[null,"Greece","Total","25 to 54 years",2010,0.12300000000000001]
[null,"Greece","Total","25 to 54 years",2011,0.17399999999999999]
[null,"Greece","Total","25 to 54 years",2012,0.24]
[null,"Greece","Total","25 to 54 years",2013,0.27200000000000002]
[null,"Greece","Total","25 to 54 years",2014,0.26100000000000001]
[null,"Greece","Total","25 to 54 years",2015,0.245]
[null,"Greece","Total","25 to 54 years",2016,0.23100000000000001]
[null,"Greece","Total","25 to 54 years",2017,0.21100000000000002]
[null,"Greece","Total","25 to 54 years",2018,0.193]
[null,"Greece","Total","25 to 54 years",2019,0.17699999999999999]
[null,"Greece","Total","25 to 54 years",2020,0.17499999999999999]
[null,"Greece","Total","25 to 54 years",2021,0.14400000000000002]
[null,"Greece","Total","25 to 54 years",2022,0.12]
[null,"Greece","Total","25 to 54 years",2023,0.11]
[null,"Greece","Total","25 to 54 years",2024,0.10099999999999999]
[null,"Hungary","Total","25 to 54 years",2010,0.1]
[null,"Hungary","Total","25 to 54 years",2011,9.6999999999999989E-2]
[null,"Hungary","Total","25 to 54 years",2012,9.6000000000000002E-2]
[null,"Hungary","Total","25 to 54 years",2013,8.6999999999999994E-2]
[null,"Hungary","Total","25 to 54 years",2014,6.6000000000000003E-2]
[null,"Hungary","Total","25 to 54 years",2015,5.7999999999999996E-2]
[null,"Hungary","Total","25 to 54 years",2016,4.4000000000000004E-2]
[null,"Hungary","Total","25 to 54 years",2017,3.6000000000000004E-2]
[null,"Hungary","Total","25 to 54 years",2018,3.2000000000000001E-2]
[null,"Hungary","Total","25 to 54 years",2019,2.8999999999999998E-2]
[null,"Hungary","Total","25 to 54 years",2020,3.7000000000000005E-2]
[null,"Hungary","Total","25 to 54 years",2021,3.5000000000000003E-2]
[null,"Hungary","Total","25 to 54 years",2022,3.2000000000000001E-2]
[null,"Hungary","Total","25 to 54 years",2023,3.6000000000000004E-2]
[null,"Hungary","Total","25 to 54 years",2024,3.7999999999999999E-2]
[null,"Ireland","Total","25 to 54 years",2010,0.13]
[null,"Ireland","Total","25 to 54 years",2011,0.14099999999999999]
[null,"Ireland","Total","25 to 54 years",2012,0.14000000000000001]
[null,"Ireland","Total","25 to 54 years",2013,0.124]
[null,"Ireland","Total","25 to 54 years",2014,0.107]
[null,"Ireland","Total","25 to 54 years",2015,8.8000000000000009E-2]
[null,"Ireland","Total","25 to 54 years",2016,7.4999999999999997E-2]
[null,"Ireland","Total","25 to 54 years",2017,5.7999999999999996E-2]
[null,"Ireland","Total","25 to 54 years",2018,4.8000000000000001E-2]
[null,"Ireland","Total","25 to 54 years",2019,4.0999999999999995E-2]
[null,"Ireland","Total","25 to 54 years",2020,4.8000000000000001E-2]
[null,"Ireland","Total","25 to 54 years",2021,0.05]
[null,"Ireland","Total","25 to 54 years",2022,3.7999999999999999E-2]
[null,"Ireland","Total","25 to 54 years",2023,3.5000000000000003E-2]
[null,"Ireland","Total","25 to 54 years",2024,3.5000000000000003E-2]
[null,"Italy","Total","25 to 54 years",2010,7.5999999999999998E-2]
[null,"Italy","Total","25 to 54 years",2011,7.5999999999999998E-2]
[null,"Italy","Total","25 to 54 years",2012,9.8000000000000004E-2]
[null,"Italy","Total","25 to 54 years",2013,0.114]
[null,"Italy","Total","25 to 54 years",2014,0.12]
[null,"Italy","Total","25 to 54 years",2015,0.11199999999999999]
[null,"Italy","Total","25 to 54 years",2016,0.111]
[null,"Italy","Total","25 to 54 years",2017,0.109]
[null,"Italy","Total","25 to 54 years",2018,0.10300000000000001]
[null,"Italy","Total","25 to 54 years",2019,9.8000000000000004E-2]
[null,"Italy","Total","25 to 54 years",2020,9.0999999999999998E-2]
[null,"Italy","Total","25 to 54 years",2021,9.1999999999999998E-2]
[null,"Italy","Total","25 to 54 years",2022,7.9000000000000001E-2]
[null,"Italy","Total","25 to 54 years",2023,7.4999999999999997E-2]
[null,"Italy","Total","25 to 54 years",2024,6.4000000000000001E-2]
[null,"Latvia","Total","25 to 54 years",2010,0.182]
[null,"Latvia","Total","25 to 54 years",2011,0.14899999999999999]
[null,"Latvia","Total","25 to 54 years",2012,0.13800000000000001]
[null,"Latvia","Total","25 to 54 years",2013,0.111]
[null,"Latvia","Total","25 to 54 years",2014,0.10400000000000001]
[null,"Latvia","Total","25 to 54 years",2015,9.6000000000000002E-2]
[null,"Latvia","Total","25 to 54 years",2016,9.4E-2]
[null,"Latvia","Total","25 to 54 years",2017,8.3000000000000004E-2]
[null,"Latvia","Total","25 to 54 years",2018,7.2000000000000008E-2]
[null,"Latvia","Total","25 to 54 years",2019,0.06]
[null,"Latvia","Total","25 to 54 years",2020,0.08]
[null,"Latvia","Total","25 to 54 years",2021,7.8E-2]
[null,"Latvia","Total","25 to 54 years",2022,6.7000000000000004E-2]
[null,"Latvia","Total","25 to 54 years",2023,6.4000000000000001E-2]
[null,"Latvia","Total","25 to 54 years",2024,6.9000000000000006E-2]
[null,"Lithuania","Total","25 to 54 years",2010,0.16699999999999998]
[null,"Lithuania","Total","25 to 54 years",2011,0.14300000000000002]
[null,"Lithuania","Total","25 to 54 years",2012,0.126]
[null,"Lithuania","Total","25 to 54 years",2013,0.11]
[null,"Lithuania","Total","25 to 54 years",2014,9.9000000000000005E-2]
[null,"Lithuania","Total","25 to 54 years",2015,8.5999999999999993E-2]
[null,"Lithuania","Total","25 to 54 years",2016,7.400000000000001E-2]
[null,"Lithuania","Total","25 to 54 years",2017,6.6000000000000003E-2]
[null,"Lithuania","Total","25 to 54 years",2018,5.5999999999999994E-2]
[null,"Lithuania","Total","25 to 54 years",2019,5.7999999999999996E-2]
[null,"Lithuania","Total","25 to 54 years",2020,7.400000000000001E-2]
[null,"Lithuania","Total","25 to 54 years",2021,6.5000000000000002E-2]
[null,"Lithuania","Total","25 to 54 years",2022,5.4000000000000006E-2]
[null,"Lithuania","Total","25 to 54 years",2023,6.2E-2]
[null,"Lithuania","Total","25 to 54 years",2024,6.2E-2]
[null,"Luxembourg","Total","25 to 54 years",2010,3.9E-2]
[null,"Luxembourg","Total","25 to 54 years",2011,4.2999999999999997E-2]
[null,"Luxembourg","Total","25 to 54 years",2012,4.4999999999999998E-2]
[null,"Luxembourg","Total","25 to 54 years",2013,5.2999999999999999E-2]
[null,"Luxembourg","Total","25 to 54 years",2014,4.9000000000000002E-2]
[null,"Luxembourg","Total","25 to 54 years",2015,5.7999999999999996E-2]
[null,"Luxembourg","Total","25 to 54 years",2016,5.2999999999999999E-2]
[null,"Luxembourg","Total","25 to 54 years",2017,4.9000000000000002E-2]
[null,"Luxembourg","Total","25 to 54 years",2018,0.05]
[null,"Luxembourg","Total","25 to 54 years",2019,4.7E-2]
[null,"Luxembourg","Total","25 to 54 years",2020,5.7000000000000002E-2]
[null,"Luxembourg","Total","25 to 54 years",2021,4.2999999999999997E-2]
[null,"Luxembourg","Total","25 to 54 years",2022,3.4000000000000002E-2]
[null,"Luxembourg","Total","25 to 54 years",2023,4.0999999999999995E-2]
[null,"Luxembourg","Total","25 to 54 years",2024,5.5E-2]
[null,"Malta","Total","25 to 54 years",2010,5.9000000000000004E-2]
[null,"Malta","Total","25 to 54 years",2011,5.4000000000000006E-2]
[null,"Malta","Total","25 to 54 years",2012,0.05]
[null,"Malta","Total","25 to 54 years",2013,0.05]
[null,"Malta","Total","25 to 54 years",2014,4.5999999999999999E-2]
[null,"Malta","Total","25 to 54 years",2015,4.2999999999999997E-2]
[null,"Malta","Total","25 to 54 years",2016,3.9E-2]
[null,"Malta","Total","25 to 54 years",2017,3.2000000000000001E-2]
[null,"Malta","Total","25 to 54 years",2018,3.2000000000000001E-2]
[null,"Malta","Total","25 to 54 years",2019,3.7000000000000005E-2]
[null,"Malta","Total","25 to 54 years",2020,4.2000000000000003E-2]
[null,"Malta","Total","25 to 54 years",2021,0.03]
[null,"Malta","Total","25 to 54 years",2022,0.03]
[null,"Malta","Total","25 to 54 years",2023,0.03]
[null,"Malta","Total","25 to 54 years",2024,2.6000000000000002E-2]
[null,"Netherlands","Total","25 to 54 years",2010,4.5999999999999999E-2]
[null,"Netherlands","Total","25 to 54 years",2011,4.7E-2]
[null,"Netherlands","Total","25 to 54 years",2012,5.4000000000000006E-2]
[null,"Netherlands","Total","25 to 54 years",2013,6.8000000000000005E-2]
[null,"Netherlands","Total","25 to 54 years",2014,7.0000000000000007E-2]
[null,"Netherlands","Total","25 to 54 years",2015,6.4000000000000001E-2]
[null,"Netherlands","Total","25 to 54 years",2016,5.4000000000000006E-2]
[null,"Netherlands","Total","25 to 54 years",2017,4.4999999999999998E-2]
[null,"Netherlands","Total","25 to 54 years",2018,3.6000000000000004E-2]
[null,"Netherlands","Total","25 to 54 years",2019,3.4000000000000002E-2]
[null,"Netherlands","Total","25 to 54 years",2020,3.7000000000000005E-2]
[null,"Netherlands","Total","25 to 54 years",2021,3.1E-2]
[null,"Netherlands","Total","25 to 54 years",2022,2.5000000000000001E-2]
[null,"Netherlands","Total","25 to 54 years",2023,2.5000000000000001E-2]
[null,"Netherlands","Total","25 to 54 years",2024,2.7000000000000003E-2]
[null,"Poland","Total","25 to 54 years",2010,8.5000000000000006E-2]
[null,"Poland","Total","25 to 54 years",2011,8.4000000000000005E-2]
[null,"Poland","Total","25 to 54 years",2012,8.900000000000001E-2]
[null,"Poland","Total","25 to 54 years",2013,9.1999999999999998E-2]
[null,"Poland","Total","25 to 54 years",2014,8.1000000000000003E-2]
[null,"Poland","Total","25 to 54 years",2015,6.8000000000000005E-2]
[null,"Poland","Total","25 to 54 years",2016,5.5E-2]
[null,"Poland","Total","25 to 54 years",2017,4.2999999999999997E-2]
[null,"Poland","Total","25 to 54 years",2018,3.4000000000000002E-2]
[null,"Poland","Total","25 to 54 years",2019,2.8999999999999998E-2]
[null,"Poland","Total","25 to 54 years",2020,2.7999999999999997E-2]
[null,"Poland","Total","25 to 54 years",2021,2.8999999999999998E-2]
[null,"Poland","Total","25 to 54 years",2022,2.5000000000000001E-2]
[null,"Poland","Total","25 to 54 years",2023,2.4E-2]
[null,"Poland","Total","25 to 54 years",2024,2.4E-2]
[null,"Portugal","Total","25 to 54 years",2010,0.115]
[null,"Portugal","Total","25 to 54 years",2011,0.121]
[null,"Portugal","Total","25 to 54 years",2012,0.14899999999999999]
[null,"Portugal","Total","25 to 54 years",2013,0.157]
[null,"Portugal","Total","25 to 54 years",2014,0.128]
[null,"Portugal","Total","25 to 54 years",2015,0.11199999999999999]
[null,"Portugal","Total","25 to 54 years",2016,0.10099999999999999]
[null,"Portugal","Total","25 to 54 years",2017,7.9000000000000001E-2]
[null,"Portugal","Total","25 to 54 years",2018,6.0999999999999999E-2]
[null,"Portugal","Total","25 to 54 years",2019,5.7000000000000002E-2]
[null,"Portugal","Total","25 to 54 years",2020,6.0999999999999999E-2]
[null,"Portugal","Total","25 to 54 years",2021,5.7000000000000002E-2]
[null,"Portugal","Total","25 to 54 years",2022,5.5E-2]
[null,"Portugal","Total","25 to 54 years",2023,5.5999999999999994E-2]
[null,"Portugal","Total","25 to 54 years",2024,5.5E-2]
[null,"Romania","Total","25 to 54 years",2010,7.5999999999999998E-2]
[null,"Romania","Total","25 to 54 years",2011,7.5999999999999998E-2]
[null,"Romania","Total","25 to 54 years",2012,7.2999999999999995E-2]
[null,"Romania","Total","25 to 54 years",2013,7.6999999999999999E-2]
[null,"Romania","Total","25 to 54 years",2014,7.2999999999999995E-2]
[null,"Romania","Total","25 to 54 years",2015,7.2999999999999995E-2]
[null,"Romania","Total","25 to 54 years",2016,6.2E-2]
[null,"Romania","Total","25 to 54 years",2017,0.05]
[null,"Romania","Total","25 to 54 years",2018,4.2999999999999997E-2]
[null,"Romania","Total","25 to 54 years",2019,3.9E-2]
[null,"Romania","Total","25 to 54 years",2020,5.2000000000000005E-2]
[null,"Romania","Total","25 to 54 years",2021,4.5999999999999999E-2]
[null,"Romania","Total","25 to 54 years",2022,4.5999999999999999E-2]
[null,"Romania","Total","25 to 54 years",2023,4.7E-2]
[null,"Romania","Total","25 to 54 years",2024,4.4999999999999998E-2]
[null,"Slovakia","Total","25 to 54 years",2010,0.128]
[null,"Slovakia","Total","25 to 54 years",2011,0.121]
[null,"Slovakia","Total","25 to 54 years",2012,0.12300000000000001]
[null,"Slovakia","Total","25 to 54 years",2013,0.128]
[null,"Slovakia","Total","25 to 54 years",2014,0.12]
[null,"Slovakia","Total","25 to 54 years",2015,0.105]
[null,"Slovakia","Total","25 to 54 years",2016,8.5999999999999993E-2]
[null,"Slovakia","Total","25 to 54 years",2017,7.4999999999999997E-2]
[null,"Slovakia","Total","25 to 54 years",2018,6.0999999999999999E-2]
[null,"Slovakia","Total","25 to 54 years",2019,5.2000000000000005E-2]
[null,"Slovakia","Total","25 to 54 years",2020,6.2E-2]
[null,"Slovakia","Total","25 to 54 years",2021,6.3E-2]
[null,"Slovakia","Total","25 to 54 years",2022,5.7000000000000002E-2]
[null,"Slovakia","Total","25 to 54 years",2023,5.5E-2]
[null,"Slovakia","Total","25 to 54 years",2024,0.05]
[null,"Slovenia","Total","25 to 54 years",2010,7.0000000000000007E-2]
[null,"Slovenia","Total","25 to 54 years",2011,7.8E-2]
[null,"Slovenia","Total","25 to 54 years",2012,8.3000000000000004E-2]
[null,"Slovenia","Total","25 to 54 years",2013,9.6999999999999989E-2]
[null,"Slovenia","Total","25 to 54 years",2014,9.3000000000000013E-2]
[null,"Slovenia","Total","25 to 54 years",2015,8.6999999999999994E-2]
[null,"Slovenia","Total","25 to 54 years",2016,7.6999999999999999E-2]
[null,"Slovenia","Total","25 to 54 years",2017,6.3E-2]
[null,"Slovenia","Total","25 to 54 years",2018,4.9000000000000002E-2]
[null,"Slovenia","Total","25 to 54 years",2019,4.2000000000000003E-2]
[null,"Slovenia","Total","25 to 54 years",2020,4.5999999999999999E-2]
[null,"Slovenia","Total","25 to 54 years",2021,4.2000000000000003E-2]
[null,"Slovenia","Total","25 to 54 years",2022,3.5000000000000003E-2]
[null,"Slovenia","Total","25 to 54 years",2023,0.03]
[null,"Slovenia","Total","25 to 54 years",2024,0.03]
[null,"Spain","Total","25 to 54 years",2010,0.184]
[null,"Spain","Total","25 to 54 years",2011,0.19899999999999998]
[null,"Spain","Total","25 to 54 years",2012,0.23300000000000001]
[null,"Spain","Total","25 to 54 years",2013,0.245]
[null,"Spain","Total","25 to 54 years",2014,0.22800000000000001]
[null,"Spain","Total","25 to 54 years",2015,0.20600000000000002]
[null,"Spain","Total","25 to 54 years",2016,0.182]
[null,"Spain","Total","25 to 54 years",2017,0.159]
[null,"Spain","Total","25 to 54 years",2018,0.14000000000000001]
[null,"Spain","Total","25 to 54 years",2019,0.129]
[null,"Spain","Total","25 to 54 years",2020,0.14499999999999999]
[null,"Spain","Total","25 to 54 years",2021,0.13699999999999998]
[null,"Spain","Total","25 to 54 years",2022,0.11900000000000001]
[null,"Spain","Total","25 to 54 years",2023,0.109]
[null,"Spain","Total","25 to 54 years",2024,0.10099999999999999]
[null,"Sweden","Total","25 to 54 years",2010,6.7000000000000004E-2]
[null,"Sweden","Total","25 to 54 years",2011,0.06]
[null,"Sweden","Total","25 to 54 years",2012,6.2E-2]
[null,"Sweden","Total","25 to 54 years",2013,6.3E-2]
[null,"Sweden","Total","25 to 54 years",2014,6.2E-2]
[null,"Sweden","Total","25 to 54 years",2015,0.06]
[null,"Sweden","Total","25 to 54 years",2016,5.7000000000000002E-2]
[null,"Sweden","Total","25 to 54 years",2017,5.5999999999999994E-2]
[null,"Sweden","Total","25 to 54 years",2018,5.4000000000000006E-2]
[null,"Sweden","Total","25 to 54 years",2019,5.5999999999999994E-2]
[null,"Sweden","Total","25 to 54 years",2020,7.0999999999999994E-2]
[null,"Sweden","Total","25 to 54 years",2021,7.0999999999999994E-2]
[null,"Sweden","Total","25 to 54 years",2022,5.7000000000000002E-2]
[null,"Sweden","Total","25 to 54 years",2023,5.9000000000000004E-2]
[null,"Sweden","Total","25 to 54 years",2024,6.4000000000000001E-2]
[null,"Austria","Total","25 to 74 years",2010,4.4000000000000004E-2]
[null,"Austria","Total","25 to 74 years",2011,4.2000000000000003E-2]
[null,"Austria","Total","25 to 74 years",2012,4.4999999999999998E-2]
[null,"Austria","Total","25 to 74 years",2013,0.05]
[null,"Austria","Total","25 to 74 years",2014,5.2999999999999999E-2]
[null,"Austria","Total","25 to 74 years",2015,5.4000000000000006E-2]
[null,"Austria","Total","25 to 74 years",2016,5.7000000000000002E-2]
[null,"Austria","Total","25 to 74 years",2017,5.2999999999999999E-2]
[null,"Austria","Total","25 to 74 years",2018,4.5999999999999999E-2]
[null,"Austria","Total","25 to 74 years",2019,4.2999999999999997E-2]
[null,"Austria","Total","25 to 74 years",2020,5.2999999999999999E-2]
[null,"Austria","Total","25 to 74 years",2021,5.5999999999999994E-2]
[null,"Austria","Total","25 to 74 years",2022,4.2000000000000003E-2]
[null,"Austria","Total","25 to 74 years",2023,4.4000000000000004E-2]
[null,"Austria","Total","25 to 74 years",2024,4.4999999999999998E-2]
[null,"Belgium","Total","25 to 74 years",2010,7.0000000000000007E-2]
[null,"Belgium","Total","25 to 74 years",2011,6.0999999999999999E-2]
[null,"Belgium","Total","25 to 74 years",2012,6.5000000000000002E-2]
[null,"Belgium","Total","25 to 74 years",2013,7.2000000000000008E-2]
[null,"Belgium","Total","25 to 74 years",2014,7.400000000000001E-2]
[null,"Belgium","Total","25 to 74 years",2015,7.4999999999999997E-2]
[null,"Belgium","Total","25 to 74 years",2016,6.9000000000000006E-2]
[null,"Belgium","Total","25 to 74 years",2017,6.2E-2]
[null,"Belgium","Total","25 to 74 years",2018,5.2000000000000005E-2]
[null,"Belgium","Total","25 to 74 years",2019,4.7E-2]
[null,"Belgium","Total","25 to 74 years",2020,0.05]
[null,"Belgium","Total","25 to 74 years",2021,5.2999999999999999E-2]
[null,"Belgium","Total","25 to 74 years",2022,4.5999999999999999E-2]
[null,"Belgium","Total","25 to 74 years",2023,4.5999999999999999E-2]
[null,"Belgium","Total","25 to 74 years",2024,4.7E-2]
[null,"Bulgaria","Total","25 to 74 years",2010,0.10099999999999999]
[null,"Bulgaria","Total","25 to 74 years",2011,0.11]
[null,"Bulgaria","Total","25 to 74 years",2012,0.11900000000000001]
[null,"Bulgaria","Total","25 to 74 years",2013,0.127]
[null,"Bulgaria","Total","25 to 74 years",2014,0.115]
[null,"Bulgaria","Total","25 to 74 years",2015,9.3000000000000013E-2]
[null,"Bulgaria","Total","25 to 74 years",2016,0.08]
[null,"Bulgaria","Total","25 to 74 years",2017,6.7000000000000004E-2]
[null,"Bulgaria","Total","25 to 74 years",2018,5.7999999999999996E-2]
[null,"Bulgaria","Total","25 to 74 years",2019,4.9000000000000002E-2]
[null,"Bulgaria","Total","25 to 74 years",2020,5.5999999999999994E-2]
[null,"Bulgaria","Total","25 to 74 years",2021,4.8000000000000001E-2]
[null,"Bulgaria","Total","25 to 74 years",2022,3.9E-2]
[null,"Bulgaria","Total","25 to 74 years",2023,0.04]
[null,"Bulgaria","Total","25 to 74 years",2024,3.7999999999999999E-2]
[null,"Croatia","Total","25 to 74 years",2010,9.5000000000000001E-2]
[null,"Croatia","Total","25 to 74 years",2011,0.11599999999999999]
[null,"Croatia","Total","25 to 74 years",2012,0.13800000000000001]
[null,"Croatia","Total","25 to 74 years",2013,0.14400000000000002]
[null,"Croatia","Total","25 to 74 years",2014,0.14599999999999999]
[null,"Croatia","Total","25 to 74 years",2015,0.13800000000000001]
[null,"Croatia","Total","25 to 74 years",2016,0.11199999999999999]
[null,"Croatia","Total","25 to 74 years",2017,9.5000000000000001E-2]
[null,"Croatia","Total","25 to 74 years",2018,7.0000000000000007E-2]
[null,"Croatia","Total","25 to 74 years",2019,5.7000000000000002E-2]
[null,"Croatia","Total","25 to 74 years",2020,6.3E-2]
[null,"Croatia","Total","25 to 74 years",2021,6.3E-2]
[null,"Croatia","Total","25 to 74 years",2022,5.9000000000000004E-2]
[null,"Croatia","Total","25 to 74 years",2023,5.0999999999999997E-2]
[null,"Croatia","Total","25 to 74 years",2024,4.2000000000000003E-2]
[null,"Cyprus","Total","25 to 74 years",2010,5.0999999999999997E-2]
[null,"Cyprus","Total","25 to 74 years",2011,6.4000000000000001E-2]
[null,"Cyprus","Total","25 to 74 years",2012,0.10199999999999999]
[null,"Cyprus","Total","25 to 74 years",2013,0.13600000000000001]
[null,"Cyprus","Total","25 to 74 years",2014,0.14000000000000001]
[null,"Cyprus","Total","25 to 74 years",2015,0.13200000000000001]
[null,"Cyprus","Total","25 to 74 years",2016,0.115]
[null,"Cyprus","Total","25 to 74 years",2017,9.9000000000000005E-2]
[null,"Cyprus","Total","25 to 74 years",2018,7.2999999999999995E-2]
[null,"Cyprus","Total","25 to 74 years",2019,6.4000000000000001E-2]
[null,"Cyprus","Total","25 to 74 years",2020,6.9000000000000006E-2]
[null,"Cyprus","Total","25 to 74 years",2021,6.5000000000000002E-2]
[null,"Cyprus","Total","25 to 74 years",2022,5.4000000000000006E-2]
[null,"Cyprus","Total","25 to 74 years",2023,5.0999999999999997E-2]
[null,"Cyprus","Total","25 to 74 years",2024,4.2999999999999997E-2]
[null,"Czechia","Total","25 to 74 years",2010,6.4000000000000001E-2]
[null,"Czechia","Total","25 to 74 years",2011,5.9000000000000004E-2]
[null,"Czechia","Total","25 to 74 years",2012,0.06]
[null,"Czechia","Total","25 to 74 years",2013,6.0999999999999999E-2]
[null,"Czechia","Total","25 to 74 years",2014,5.4000000000000006E-2]
[null,"Czechia","Total","25 to 74 years",2015,4.4999999999999998E-2]
[null,"Czechia","Total","25 to 74 years",2016,3.5000000000000003E-2]
[null,"Czechia","Total","25 to 74 years",2017,2.6000000000000002E-2]
[null,"Czechia","Total","25 to 74 years",2018,0.02]
[null,"Czechia","Total","25 to 74 years",2019,1.8000000000000002E-2]
[null,"Czechia","Total","25 to 74 years",2020,2.3E-2]
[null,"Czechia","Total","25 to 74 years",2021,2.5000000000000001E-2]
[null,"Czechia","Total","25 to 74 years",2022,0.02]
[null,"Czechia","Total","25 to 74 years",2023,2.2000000000000002E-2]
[null,"Czechia","Total","25 to 74 years",2024,2.2000000000000002E-2]
[null,"Denmark","Total","25 to 74 years",2010,6.4000000000000001E-2]
[null,"Denmark","Total","25 to 74 years",2011,6.2E-2]
[null,"Denmark","Total","25 to 74 years",2012,6.4000000000000001E-2]
[null,"Denmark","Total","25 to 74 years",2013,6.0999999999999999E-2]
[null,"Denmark","Total","25 to 74 years",2014,5.7000000000000002E-2]
[null,"Denmark","Total","25 to 74 years",2015,5.2999999999999999E-2]
[null,"Denmark","Total","25 to 74 years",2016,4.9000000000000002E-2]
[null,"Denmark","Total","25 to 74 years",2017,4.7E-2]
[null,"Denmark","Total","25 to 74 years",2018,4.2000000000000003E-2]
[null,"Denmark","Total","25 to 74 years",2019,4.2000000000000003E-2]
[null,"Denmark","Total","25 to 74 years",2020,4.7E-2]
[null,"Denmark","Total","25 to 74 years",2021,4.2000000000000003E-2]
[null,"Denmark","Total","25 to 74 years",2022,3.5000000000000003E-2]
[null,"Denmark","Total","25 to 74 years",2023,0.04]
[null,"Denmark","Total","25 to 74 years",2024,4.7E-2]
[null,"Estonia","Total","25 to 74 years",2010,0.14800000000000002]
[null,"Estonia","Total","25 to 74 years",2011,0.11199999999999999]
[null,"Estonia","Total","25 to 74 years",2012,8.8000000000000009E-2]
[null,"Estonia","Total","25 to 74 years",2013,7.5999999999999998E-2]
[null,"Estonia","Total","25 to 74 years",2014,6.6000000000000003E-2]
[null,"Estonia","Total","25 to 74 years",2015,5.7000000000000002E-2]
[null,"Estonia","Total","25 to 74 years",2016,6.2E-2]
[null,"Estonia","Total","25 to 74 years",2017,5.2000000000000005E-2]
[null,"Estonia","Total","25 to 74 years",2018,4.8000000000000001E-2]
[null,"Estonia","Total","25 to 74 years",2019,3.9E-2]
[null,"Estonia","Total","25 to 74 years",2020,0.06]
[null,"Estonia","Total","25 to 74 years",2021,5.4000000000000006E-2]
[null,"Estonia","Total","25 to 74 years",2022,4.4999999999999998E-2]
[null,"Estonia","Total","25 to 74 years",2023,5.5E-2]
[null,"Estonia","Total","25 to 74 years",2024,6.5000000000000002E-2]
[null,"Finland","Total","25 to 74 years",2010,6.7000000000000004E-2]
[null,"Finland","Total","25 to 74 years",2011,6.3E-2]
[null,"Finland","Total","25 to 74 years",2012,6.2E-2]
[null,"Finland","Total","25 to 74 years",2013,6.6000000000000003E-2]
[null,"Finland","Total","25 to 74 years",2014,7.0999999999999994E-2]
[null,"Finland","Total","25 to 74 years",2015,7.5999999999999998E-2]
[null,"Finland","Total","25 to 74 years",2016,7.2999999999999995E-2]
[null,"Finland","Total","25 to 74 years",2017,7.2000000000000008E-2]
[null,"Finland","Total","25 to 74 years",2018,6.0999999999999999E-2]
[null,"Finland","Total","25 to 74 years",2019,5.2999999999999999E-2]
[null,"Finland","Total","25 to 74 years",2020,0.06]
[null,"Finland","Total","25 to 74 years",2021,6.5000000000000002E-2]
[null,"Finland","Total","25 to 74 years",2022,5.7999999999999996E-2]
[null,"Finland","Total","25 to 74 years",2023,0.06]
[null,"Finland","Total","25 to 74 years",2024,7.0999999999999994E-2]
[null,"France","Total","25 to 74 years",2010,7.4999999999999997E-2]
[null,"France","Total","25 to 74 years",2011,7.5999999999999998E-2]
[null,"France","Total","25 to 74 years",2012,8.1000000000000003E-2]
[null,"France","Total","25 to 74 years",2013,8.5999999999999993E-2]
[null,"France","Total","25 to 74 years",2014,8.6999999999999994E-2]
[null,"France","Total","25 to 74 years",2015,8.6999999999999994E-2]
[null,"France","Total","25 to 74 years",2016,8.4000000000000005E-2]
[null,"France","Total","25 to 74 years",2017,7.9000000000000001E-2]
[null,"France","Total","25 to 74 years",2018,7.5999999999999998E-2]
[null,"France","Total","25 to 74 years",2019,7.0999999999999994E-2]
[null,"France","Total","25 to 74 years",2020,6.6000000000000003E-2]
[null,"France","Total","25 to 74 years",2021,6.6000000000000003E-2]
[null,"France","Total","25 to 74 years",2022,6.0999999999999999E-2]
[null,"France","Total","25 to 74 years",2023,6.0999999999999999E-2]
[null,"France","Total","25 to 74 years",2024,0.06]
[null,"Germany","Total","25 to 74 years",2010,6.0999999999999999E-2]
[null,"Germany","Total","25 to 74 years",2011,5.0999999999999997E-2]
[null,"Germany","Total","25 to 74 years",2012,4.7E-2]
[null,"Germany","Total","25 to 74 years",2013,4.4999999999999998E-2]
[null,"Germany","Total","25 to 74 years",2014,4.2999999999999997E-2]
[null,"Germany","Total","25 to 74 years",2015,0.04]
[null,"Germany","Total","25 to 74 years",2016,3.5000000000000003E-2]
[null,"Germany","Total","25 to 74 years",2017,3.1E-2]
[null,"Germany","Total","25 to 74 years",2018,2.7999999999999997E-2]
[null,"Germany","Total","25 to 74 years",2019,2.6000000000000002E-2]
[null,"Germany","Total","25 to 74 years",2020,3.1E-2]
[null,"Germany","Total","25 to 74 years",2021,3.2000000000000001E-2]
[null,"Germany","Total","25 to 74 years",2022,2.7999999999999997E-2]
[null,"Germany","Total","25 to 74 years",2023,2.7999999999999997E-2]
[null,"Germany","Total","25 to 74 years",2024,0.03]
[null,"Greece","Total","25 to 74 years",2010,0.113]
[null,"Greece","Total","25 to 74 years",2011,0.161]
[null,"Greece","Total","25 to 74 years",2012,0.22500000000000001]
[null,"Greece","Total","25 to 74 years",2013,0.25600000000000001]
[null,"Greece","Total","25 to 74 years",2014,0.248]
[null,"Greece","Total","25 to 74 years",2015,0.23300000000000001]
[null,"Greece","Total","25 to 74 years",2016,0.22399999999999998]
[null,"Greece","Total","25 to 74 years",2017,0.20499999999999999]
[null,"Greece","Total","25 to 74 years",2018,0.185]
[null,"Greece","Total","25 to 74 years",2019,0.16800000000000001]
[null,"Greece","Total","25 to 74 years",2020,0.16600000000000001]
[null,"Greece","Total","25 to 74 years",2021,0.13699999999999998]
[null,"Greece","Total","25 to 74 years",2022,0.114]
[null,"Greece","Total","25 to 74 years",2023,0.10199999999999999]
[null,"Greece","Total","25 to 74 years",2024,9.4E-2]
[null,"Hungary","Total","25 to 74 years",2010,9.6999999999999989E-2]
[null,"Hungary","Total","25 to 74 years",2011,9.6000000000000002E-2]
[null,"Hungary","Total","25 to 74 years",2012,9.4E-2]
[null,"Hungary","Total","25 to 74 years",2013,8.5999999999999993E-2]
[null,"Hungary","Total","25 to 74 years",2014,6.5000000000000002E-2]
[null,"Hungary","Total","25 to 74 years",2015,5.7999999999999996E-2]
[null,"Hungary","Total","25 to 74 years",2016,4.2999999999999997E-2]
[null,"Hungary","Total","25 to 74 years",2017,3.5000000000000003E-2]
[null,"Hungary","Total","25 to 74 years",2018,3.1E-2]
[null,"Hungary","Total","25 to 74 years",2019,2.7000000000000003E-2]
[null,"Hungary","Total","25 to 74 years",2020,3.5000000000000003E-2]
[null,"Hungary","Total","25 to 74 years",2021,3.4000000000000002E-2]
[null,"Hungary","Total","25 to 74 years",2022,3.2000000000000001E-2]
[null,"Hungary","Total","25 to 74 years",2023,3.5000000000000003E-2]
[null,"Hungary","Total","25 to 74 years",2024,3.7999999999999999E-2]
[null,"Ireland","Total","25 to 74 years",2010,0.12300000000000001]
[null,"Ireland","Total","25 to 74 years",2011,0.13200000000000001]
[null,"Ireland","Total","25 to 74 years",2012,0.13200000000000001]
[null,"Ireland","Total","25 to 74 years",2013,0.11900000000000001]
[null,"Ireland","Total","25 to 74 years",2014,0.10300000000000001]
[null,"Ireland","Total","25 to 74 years",2015,8.5000000000000006E-2]
[null,"Ireland","Total","25 to 74 years",2016,7.2000000000000008E-2]
[null,"Ireland","Total","25 to 74 years",2017,5.7000000000000002E-2]
[null,"Ireland","Total","25 to 74 years",2018,4.7E-2]
[null,"Ireland","Total","25 to 74 years",2019,0.04]
[null,"Ireland","Total","25 to 74 years",2020,4.5999999999999999E-2]
[null,"Ireland","Total","25 to 74 years",2021,0.05]
[null,"Ireland","Total","25 to 74 years",2022,3.7000000000000005E-2]
[null,"Ireland","Total","25 to 74 years",2023,3.4000000000000002E-2]
[null,"Ireland","Total","25 to 74 years",2024,3.4000000000000002E-2]
[null,"Italy","Total","25 to 74 years",2010,7.0999999999999994E-2]
[null,"Italy","Total","25 to 74 years",2011,7.0999999999999994E-2]
[null,"Italy","Total","25 to 74 years",2012,9.0999999999999998E-2]
[null,"Italy","Total","25 to 74 years",2013,0.105]
[null,"Italy","Total","25 to 74 years",2014,0.10800000000000001]
[null,"Italy","Total","25 to 74 years",2015,0.10199999999999999]
[null,"Italy","Total","25 to 74 years",2016,0.10099999999999999]
[null,"Italy","Total","25 to 74 years",2017,9.8000000000000004E-2]
[null,"Italy","Total","25 to 74 years",2018,9.1999999999999998E-2]
[null,"Italy","Total","25 to 74 years",2019,8.6999999999999994E-2]
[null,"Italy","Total","25 to 74 years",2020,8.1000000000000003E-2]
[null,"Italy","Total","25 to 74 years",2021,8.3000000000000004E-2]
[null,"Italy","Total","25 to 74 years",2022,7.0999999999999994E-2]
[null,"Italy","Total","25 to 74 years",2023,6.7000000000000004E-2]
[null,"Italy","Total","25 to 74 years",2024,5.7000000000000002E-2]
[null,"Latvia","Total","25 to 74 years",2010,0.17600000000000002]
[null,"Latvia","Total","25 to 74 years",2011,0.14699999999999999]
[null,"Latvia","Total","25 to 74 years",2012,0.13699999999999998]
[null,"Latvia","Total","25 to 74 years",2013,0.10800000000000001]
[null,"Latvia","Total","25 to 74 years",2014,0.1]
[null,"Latvia","Total","25 to 74 years",2015,9.3000000000000013E-2]
[null,"Latvia","Total","25 to 74 years",2016,9.0999999999999998E-2]
[null,"Latvia","Total","25 to 74 years",2017,8.1000000000000003E-2]
[null,"Latvia","Total","25 to 74 years",2018,7.0999999999999994E-2]
[null,"Latvia","Total","25 to 74 years",2019,5.9000000000000004E-2]
[null,"Latvia","Total","25 to 74 years",2020,7.6999999999999999E-2]
[null,"Latvia","Total","25 to 74 years",2021,7.0999999999999994E-2]
[null,"Latvia","Total","25 to 74 years",2022,6.2E-2]
[null,"Latvia","Total","25 to 74 years",2023,6.0999999999999999E-2]
[null,"Latvia","Total","25 to 74 years",2024,6.4000000000000001E-2]
[null,"Lithuania","Total","25 to 74 years",2010,0.161]
[null,"Lithuania","Total","25 to 74 years",2011,0.13900000000000001]
[null,"Lithuania","Total","25 to 74 years",2012,0.122]
[null,"Lithuania","Total","25 to 74 years",2013,0.109]
[null,"Lithuania","Total","25 to 74 years",2014,9.9000000000000005E-2]
[null,"Lithuania","Total","25 to 74 years",2015,8.5000000000000006E-2]
[null,"Lithuania","Total","25 to 74 years",2016,7.2999999999999995E-2]
[null,"Lithuania","Total","25 to 74 years",2017,6.6000000000000003E-2]
[null,"Lithuania","Total","25 to 74 years",2018,5.7999999999999996E-2]
[null,"Lithuania","Total","25 to 74 years",2019,5.7999999999999996E-2]
[null,"Lithuania","Total","25 to 74 years",2020,7.6999999999999999E-2]
[null,"Lithuania","Total","25 to 74 years",2021,6.6000000000000003E-2]
[null,"Lithuania","Total","25 to 74 years",2022,5.5999999999999994E-2]
[null,"Lithuania","Total","25 to 74 years",2023,6.4000000000000001E-2]
[null,"Lithuania","Total","25 to 74 years",2024,6.5000000000000002E-2]
[null,"Luxembourg","Total","25 to 74 years",2010,3.7000000000000005E-2]
[null,"Luxembourg","Total","25 to 74 years",2011,4.0999999999999995E-2]
[null,"Luxembourg","Total","25 to 74 years",2012,4.2000000000000003E-2]
[null,"Luxembourg","Total","25 to 74 years",2013,5.2000000000000005E-2]
[null,"Luxembourg","Total","25 to 74 years",2014,4.8000000000000001E-2]
[null,"Luxembourg","Total","25 to 74 years",2015,5.7000000000000002E-2]
[null,"Luxembourg","Total","25 to 74 years",2016,5.2999999999999999E-2]
[null,"Luxembourg","Total","25 to 74 years",2017,4.7E-2]
[null,"Luxembourg","Total","25 to 74 years",2018,4.9000000000000002E-2]
[null,"Luxembourg","Total","25 to 74 years",2019,4.5999999999999999E-2]
[null,"Luxembourg","Total","25 to 74 years",2020,5.5E-2]
[null,"Luxembourg","Total","25 to 74 years",2021,4.2999999999999997E-2]
[null,"Luxembourg","Total","25 to 74 years",2022,3.6000000000000004E-2]
[null,"Luxembourg","Total","25 to 74 years",2023,4.0999999999999995E-2]
[null,"Luxembourg","Total","25 to 74 years",2024,5.0999999999999997E-2]
[null,"Malta","Total","25 to 74 years",2010,5.5999999999999994E-2]
[null,"Malta","Total","25 to 74 years",2011,0.05]
[null,"Malta","Total","25 to 74 years",2012,4.8000000000000001E-2]
[null,"Malta","Total","25 to 74 years",2013,4.9000000000000002E-2]
[null,"Malta","Total","25 to 74 years",2014,4.7E-2]
[null,"Malta","Total","25 to 74 years",2015,4.4000000000000004E-2]
[null,"Malta","Total","25 to 74 years",2016,3.7999999999999999E-2]
[null,"Malta","Total","25 to 74 years",2017,3.1E-2]
[null,"Malta","Total","25 to 74 years",2018,3.2000000000000001E-2]
[null,"Malta","Total","25 to 74 years",2019,3.3000000000000002E-2]
[null,"Malta","Total","25 to 74 years",2020,4.0999999999999995E-2]
[null,"Malta","Total","25 to 74 years",2021,3.1E-2]
[null,"Malta","Total","25 to 74 years",2022,2.8999999999999998E-2]
[null,"Malta","Total","25 to 74 years",2023,2.8999999999999998E-2]
[null,"Malta","Total","25 to 74 years",2024,2.5000000000000001E-2]
[null,"Netherlands","Total","25 to 74 years",2010,4.7E-2]
[null,"Netherlands","Total","25 to 74 years",2011,4.9000000000000002E-2]
[null,"Netherlands","Total","25 to 74 years",2012,5.5999999999999994E-2]
[null,"Netherlands","Total","25 to 74 years",2013,7.0000000000000007E-2]
[null,"Netherlands","Total","25 to 74 years",2014,7.2999999999999995E-2]
[null,"Netherlands","Total","25 to 74 years",2015,6.9000000000000006E-2]
[null,"Netherlands","Total","25 to 74 years",2016,5.9000000000000004E-2]
[null,"Netherlands","Total","25 to 74 years",2017,4.9000000000000002E-2]
[null,"Netherlands","Total","25 to 74 years",2018,0.04]
[null,"Netherlands","Total","25 to 74 years",2019,3.6000000000000004E-2]
[null,"Netherlands","Total","25 to 74 years",2020,3.7000000000000005E-2]
[null,"Netherlands","Total","25 to 74 years",2021,3.2000000000000001E-2]
[null,"Netherlands","Total","25 to 74 years",2022,2.7000000000000003E-2]
[null,"Netherlands","Total","25 to 74 years",2023,2.5000000000000001E-2]
[null,"Netherlands","Total","25 to 74 years",2024,2.6000000000000002E-2]
[null,"Poland","Total","25 to 74 years",2010,8.4000000000000005E-2]
[null,"Poland","Total","25 to 74 years",2011,8.199999999999999E-2]
[null,"Poland","Total","25 to 74 years",2012,8.6999999999999994E-2]
[null,"Poland","Total","25 to 74 years",2013,0.09]
[null,"Poland","Total","25 to 74 years",2014,7.8E-2]
[null,"Poland","Total","25 to 74 years",2015,6.5000000000000002E-2]
[null,"Poland","Total","25 to 74 years",2016,5.2999999999999999E-2]
[null,"Poland","Total","25 to 74 years",2017,4.0999999999999995E-2]
[null,"Poland","Total","25 to 74 years",2018,3.2000000000000001E-2]
[null,"Poland","Total","25 to 74 years",2019,2.7999999999999997E-2]
[null,"Poland","Total","25 to 74 years",2020,2.7000000000000003E-2]
[null,"Poland","Total","25 to 74 years",2021,2.7999999999999997E-2]
[null,"Poland","Total","25 to 74 years",2022,2.4E-2]
[null,"Poland","Total","25 to 74 years",2023,2.2000000000000002E-2]
[null,"Poland","Total","25 to 74 years",2024,2.3E-2]
[null,"Portugal","Total","25 to 74 years",2010,0.111]
[null,"Portugal","Total","25 to 74 years",2011,0.12]
[null,"Portugal","Total","25 to 74 years",2012,0.14599999999999999]
[null,"Portugal","Total","25 to 74 years",2013,0.154]
[null,"Portugal","Total","25 to 74 years",2014,0.129]
[null,"Portugal","Total","25 to 74 years",2015,0.114]
[null,"Portugal","Total","25 to 74 years",2016,0.10199999999999999]
[null,"Portugal","Total","25 to 74 years",2017,0.08]
[null,"Portugal","Total","25 to 74 years",2018,6.2E-2]
[null,"Portugal","Total","25 to 74 years",2019,5.7000000000000002E-2]
[null,"Portugal","Total","25 to 74 years",2020,0.06]
[null,"Portugal","Total","25 to 74 years",2021,5.5999999999999994E-2]
[null,"Portugal","Total","25 to 74 years",2022,5.2999999999999999E-2]
[null,"Portugal","Total","25 to 74 years",2023,5.5E-2]
[null,"Portugal","Total","25 to 74 years",2024,5.2999999999999999E-2]
[null,"Romania","Total","25 to 74 years",2010,7.2999999999999995E-2]
[null,"Romania","Total","25 to 74 years",2011,7.2999999999999995E-2]
[null,"Romania","Total","25 to 74 years",2012,7.0000000000000007E-2]
[null,"Romania","Total","25 to 74 years",2013,7.2999999999999995E-2]
[null,"Romania","Total","25 to 74 years",2014,6.9000000000000006E-2]
[null,"Romania","Total","25 to 74 years",2015,6.9000000000000006E-2]
[null,"Romania","Total","25 to 74 years",2016,5.9000000000000004E-2]
[null,"Romania","Total","25 to 74 years",2017,4.9000000000000002E-2]
[null,"Romania","Total","25 to 74 years",2018,4.2000000000000003E-2]
[null,"Romania","Total","25 to 74 years",2019,3.7999999999999999E-2]
[null,"Romania","Total","25 to 74 years",2020,0.05]
[null,"Romania","Total","25 to 74 years",2021,4.4999999999999998E-2]
[null,"Romania","Total","25 to 74 years",2022,4.4999999999999998E-2]
[null,"Romania","Total","25 to 74 years",2023,4.5999999999999999E-2]
[null,"Romania","Total","25 to 74 years",2024,4.2000000000000003E-2]
[null,"Slovakia","Total","25 to 74 years",2010,0.12300000000000001]
[null,"Slovakia","Total","25 to 74 years",2011,0.11599999999999999]
[null,"Slovakia","Total","25 to 74 years",2012,0.12]
[null,"Slovakia","Total","25 to 74 years",2013,0.12300000000000001]
[null,"Slovakia","Total","25 to 74 years",2014,0.11599999999999999]
[null,"Slovakia","Total","25 to 74 years",2015,0.10099999999999999]
[null,"Slovakia","Total","25 to 74 years",2016,8.5000000000000006E-2]
[null,"Slovakia","Total","25 to 74 years",2017,7.2000000000000008E-2]
[null,"Slovakia","Total","25 to 74 years",2018,5.7999999999999996E-2]
[null,"Slovakia","Total","25 to 74 years",2019,0.05]
[null,"Slovakia","Total","25 to 74 years",2020,5.7999999999999996E-2]
[null,"Slovakia","Total","25 to 74 years",2021,6.0999999999999999E-2]
[null,"Slovakia","Total","25 to 74 years",2022,5.4000000000000006E-2]
[null,"Slovakia","Total","25 to 74 years",2023,5.0999999999999997E-2]
[null,"Slovakia","Total","25 to 74 years",2024,4.5999999999999999E-2]
[null,"Slovenia","Total","25 to 74 years",2010,6.5000000000000002E-2]
[null,"Slovenia","Total","25 to 74 years",2011,7.4999999999999997E-2]
[null,"Slovenia","Total","25 to 74 years",2012,7.9000000000000001E-2]
[null,"Slovenia","Total","25 to 74 years",2013,9.1999999999999998E-2]
[null,"Slovenia","Total","25 to 74 years",2014,8.900000000000001E-2]
[null,"Slovenia","Total","25 to 74 years",2015,8.4000000000000005E-2]
[null,"Slovenia","Total","25 to 74 years",2016,7.4999999999999997E-2]
[null,"Slovenia","Total","25 to 74 years",2017,6.2E-2]
[null,"Slovenia","Total","25 to 74 years",2018,4.8000000000000001E-2]
[null,"Slovenia","Total","25 to 74 years",2019,4.2000000000000003E-2]
[null,"Slovenia","Total","25 to 74 years",2020,4.4000000000000004E-2]
[null,"Slovenia","Total","25 to 74 years",2021,4.2000000000000003E-2]
[null,"Slovenia","Total","25 to 74 years",2022,3.6000000000000004E-2]
[null,"Slovenia","Total","25 to 74 years",2023,3.2000000000000001E-2]
[null,"Slovenia","Total","25 to 74 years",2024,3.1E-2]
[null,"Spain","Total","25 to 74 years",2010,0.17800000000000002]
[null,"Spain","Total","25 to 74 years",2011,0.192]
[null,"Spain","Total","25 to 74 years",2012,0.22500000000000001]
[null,"Spain","Total","25 to 74 years",2013,0.23800000000000002]
[null,"Spain","Total","25 to 74 years",2014,0.223]
[null,"Spain","Total","25 to 74 years",2015,0.20199999999999999]
[null,"Spain","Total","25 to 74 years",2016,0.17899999999999999]
[null,"Spain","Total","25 to 74 years",2017,0.157]
[null,"Spain","Total","25 to 74 years",2018,0.13900000000000001]
[null,"Spain","Total","25 to 74 years",2019,0.128]
[null,"Spain","Total","25 to 74 years",2020,0.14000000000000001]
[null,"Spain","Total","25 to 74 years",2021,0.13500000000000001]
[null,"Spain","Total","25 to 74 years",2022,0.11800000000000001]
[null,"Spain","Total","25 to 74 years",2023,0.109]
[null,"Spain","Total","25 to 74 years",2024,0.10199999999999999]
[null,"Sweden","Total","25 to 74 years",2010,6.4000000000000001E-2]
[null,"Sweden","Total","25 to 74 years",2011,5.7000000000000002E-2]
[null,"Sweden","Total","25 to 74 years",2012,5.9000000000000004E-2]
[null,"Sweden","Total","25 to 74 years",2013,5.9000000000000004E-2]
[null,"Sweden","Total","25 to 74 years",2014,5.9000000000000004E-2]
[null,"Sweden","Total","25 to 74 years",2015,5.7999999999999996E-2]
[null,"Sweden","Total","25 to 74 years",2016,5.5E-2]
[null,"Sweden","Total","25 to 74 years",2017,5.4000000000000006E-2]
[null,"Sweden","Total","25 to 74 years",2018,5.0999999999999997E-2]
[null,"Sweden","Total","25 to 74 years",2019,5.2999999999999999E-2]
[null,"Sweden","Total","25 to 74 years",2020,6.7000000000000004E-2]
[null,"Sweden","Total","25 to 74 years",2021,6.9000000000000006E-2]
[null,"Sweden","Total","25 to 74 years",2022,5.5999999999999994E-2]
[null,"Sweden","Total","25 to 74 years",2023,5.7000000000000002E-2]
[null,"Sweden","Total","25 to 74 years",2024,6.2E-2]
[null,"Austria","Total","55 to 74 years",2010,2.4E-2]
[null,"Austria","Total","55 to 74 years",2011,3.5000000000000003E-2]
[null,"Austria","Total","55 to 74 years",2012,3.3000000000000002E-2]
[null,"Austria","Total","55 to 74 years",2013,3.6000000000000004E-2]
[null,"Austria","Total","55 to 74 years",2014,3.7999999999999999E-2]
[null,"Austria","Total","55 to 74 years",2015,4.5999999999999999E-2]
[null,"Austria","Total","55 to 74 years",2016,4.9000000000000002E-2]
[null,"Austria","Total","55 to 74 years",2017,4.2999999999999997E-2]
[null,"Austria","Total","55 to 74 years",2018,3.7999999999999999E-2]
[null,"Austria","Total","55 to 74 years",2019,3.4000000000000002E-2]
[null,"Austria","Total","55 to 74 years",2020,4.2000000000000003E-2]
[null,"Austria","Total","55 to 74 years",2021,4.8000000000000001E-2]
[null,"Austria","Total","55 to 74 years",2022,3.5000000000000003E-2]
[null,"Austria","Total","55 to 74 years",2023,3.9E-2]
[null,"Austria","Total","55 to 74 years",2024,3.6000000000000004E-2]
[null,"Belgium","Total","55 to 74 years",2010,4.4999999999999998E-2]
[null,"Belgium","Total","55 to 74 years",2011,3.9E-2]
[null,"Belgium","Total","55 to 74 years",2012,4.4000000000000004E-2]
[null,"Belgium","Total","55 to 74 years",2013,5.2000000000000005E-2]
[null,"Belgium","Total","55 to 74 years",2014,5.2000000000000005E-2]
[null,"Belgium","Total","55 to 74 years",2015,5.5E-2]
[null,"Belgium","Total","55 to 74 years",2016,5.5E-2]
[null,"Belgium","Total","55 to 74 years",2017,5.7000000000000002E-2]
[null,"Belgium","Total","55 to 74 years",2018,4.2000000000000003E-2]
[null,"Belgium","Total","55 to 74 years",2019,0.04]
[null,"Belgium","Total","55 to 74 years",2020,4.2000000000000003E-2]
[null,"Belgium","Total","55 to 74 years",2021,4.4999999999999998E-2]
[null,"Belgium","Total","55 to 74 years",2022,3.6000000000000004E-2]
[null,"Belgium","Total","55 to 74 years",2023,3.4000000000000002E-2]
[null,"Belgium","Total","55 to 74 years",2024,3.3000000000000002E-2]
[null,"Bulgaria","Total","55 to 74 years",2010,9.6000000000000002E-2]
[null,"Bulgaria","Total","55 to 74 years",2011,9.3000000000000013E-2]
[null,"Bulgaria","Total","55 to 74 years",2012,0.10800000000000001]
[null,"Bulgaria","Total","55 to 74 years",2013,0.128]
[null,"Bulgaria","Total","55 to 74 years",2014,0.121]
[null,"Bulgaria","Total","55 to 74 years",2015,9.1999999999999998E-2]
[null,"Bulgaria","Total","55 to 74 years",2016,7.8E-2]
[null,"Bulgaria","Total","55 to 74 years",2017,6.6000000000000003E-2]
[null,"Bulgaria","Total","55 to 74 years",2018,5.2999999999999999E-2]
[null,"Bulgaria","Total","55 to 74 years",2019,4.5999999999999999E-2]
[null,"Bulgaria","Total","55 to 74 years",2020,4.9000000000000002E-2]
[null,"Bulgaria","Total","55 to 74 years",2021,4.2999999999999997E-2]
[null,"Bulgaria","Total","55 to 74 years",2022,3.4000000000000002E-2]
[null,"Bulgaria","Total","55 to 74 years",2023,3.4000000000000002E-2]
[null,"Bulgaria","Total","55 to 74 years",2024,3.1E-2]
[null,"Croatia","Total","55 to 74 years",2010,5.7999999999999996E-2]
[null,"Croatia","Total","55 to 74 years",2011,7.0000000000000007E-2]
[null,"Croatia","Total","55 to 74 years",2012,9.4E-2]
[null,"Croatia","Total","55 to 74 years",2013,9.0999999999999998E-2]
[null,"Croatia","Total","55 to 74 years",2014,0.111]
[null,"Croatia","Total","55 to 74 years",2015,0.107]
[null,"Croatia","Total","55 to 74 years",2016,8.900000000000001E-2]
[null,"Croatia","Total","55 to 74 years",2017,7.400000000000001E-2]
[null,"Croatia","Total","55 to 74 years",2018,4.2000000000000003E-2]
[null,"Croatia","Total","55 to 74 years",2019,3.3000000000000002E-2]
[null,"Croatia","Total","55 to 74 years",2020,4.7E-2]
[null,"Croatia","Total","55 to 74 years",2021,4.2999999999999997E-2]
[null,"Croatia","Total","55 to 74 years",2022,4.5999999999999999E-2]
[null,"Croatia","Total","55 to 74 years",2023,4.0999999999999995E-2]
[null,"Croatia","Total","55 to 74 years",2024,3.4000000000000002E-2]
[null,"Cyprus","Total","55 to 74 years",2010,0.04]
[null,"Cyprus","Total","55 to 74 years",2011,4.2999999999999997E-2]
[null,"Cyprus","Total","55 to 74 years",2012,8.5999999999999993E-2]
[null,"Cyprus","Total","55 to 74 years",2013,0.11699999999999999]
[null,"Cyprus","Total","55 to 74 years",2014,0.14699999999999999]
[null,"Cyprus","Total","55 to 74 years",2015,0.14000000000000001]
[null,"Cyprus","Total","55 to 74 years",2016,0.105]
[null,"Cyprus","Total","55 to 74 years",2017,7.0999999999999994E-2]
[null,"Cyprus","Total","55 to 74 years",2018,5.2000000000000005E-2]
[null,"Cyprus","Total","55 to 74 years",2019,5.5999999999999994E-2]
[null,"Cyprus","Total","55 to 74 years",2020,5.5E-2]
[null,"Cyprus","Total","55 to 74 years",2021,5.0999999999999997E-2]
[null,"Cyprus","Total","55 to 74 years",2022,4.2000000000000003E-2]
[null,"Cyprus","Total","55 to 74 years",2023,0.04]
[null,"Cyprus","Total","55 to 74 years",2024,2.8999999999999998E-2]
[null,"Czechia","Total","55 to 74 years",2010,6.0999999999999999E-2]
[null,"Czechia","Total","55 to 74 years",2011,5.4000000000000006E-2]
[null,"Czechia","Total","55 to 74 years",2012,5.5999999999999994E-2]
[null,"Czechia","Total","55 to 74 years",2013,5.4000000000000006E-2]
[null,"Czechia","Total","55 to 74 years",2014,4.5999999999999999E-2]
[null,"Czechia","Total","55 to 74 years",2015,0.04]
[null,"Czechia","Total","55 to 74 years",2016,3.5000000000000003E-2]
[null,"Czechia","Total","55 to 74 years",2017,2.2000000000000002E-2]
[null,"Czechia","Total","55 to 74 years",2018,1.8000000000000002E-2]
[null,"Czechia","Total","55 to 74 years",2019,1.8000000000000002E-2]
[null,"Czechia","Total","55 to 74 years",2020,1.8000000000000002E-2]
[null,"Czechia","Total","55 to 74 years",2021,2.1000000000000001E-2]
[null,"Czechia","Total","55 to 74 years",2022,1.8000000000000002E-2]
[null,"Czechia","Total","55 to 74 years",2023,0.02]
[null,"Czechia","Total","55 to 74 years",2024,1.8000000000000002E-2]
[null,"Denmark","Total","55 to 74 years",2010,5.0999999999999997E-2]
[null,"Denmark","Total","55 to 74 years",2011,0.05]
[null,"Denmark","Total","55 to 74 years",2012,0.05]
[null,"Denmark","Total","55 to 74 years",2013,4.7E-2]
[null,"Denmark","Total","55 to 74 years",2014,4.4000000000000004E-2]
[null,"Denmark","Total","55 to 74 years",2015,3.7999999999999999E-2]
[null,"Denmark","Total","55 to 74 years",2016,3.6000000000000004E-2]
[null,"Denmark","Total","55 to 74 years",2017,3.3000000000000002E-2]
[null,"Denmark","Total","55 to 74 years",2018,3.2000000000000001E-2]
[null,"Denmark","Total","55 to 74 years",2019,3.1E-2]
[null,"Denmark","Total","55 to 74 years",2020,3.7999999999999999E-2]
[null,"Denmark","Total","55 to 74 years",2021,3.9E-2]
[null,"Denmark","Total","55 to 74 years",2022,2.8999999999999998E-2]
[null,"Denmark","Total","55 to 74 years",2023,0.03]
[null,"Denmark","Total","55 to 74 years",2024,3.7999999999999999E-2]
[null,"Estonia","Total","55 to 74 years",2010,0.14199999999999999]
[null,"Estonia","Total","55 to 74 years",2011,0.10300000000000001]
[null,"Estonia","Total","55 to 74 years",2012,6.6000000000000003E-2]
[null,"Estonia","Total","55 to 74 years",2013,5.5E-2]
[null,"Estonia","Total","55 to 74 years",2014,0.05]
[null,"Estonia","Total","55 to 74 years",2015,5.7000000000000002E-2]
[null,"Estonia","Total","55 to 74 years",2016,7.0000000000000007E-2]
[null,"Estonia","Total","55 to 74 years",2017,5.0999999999999997E-2]
[null,"Estonia","Total","55 to 74 years",2018,5.0999999999999997E-2]
[null,"Estonia","Total","55 to 74 years",2019,3.6000000000000004E-2]
[null,"Estonia","Total","55 to 74 years",2020,0.06]
[null,"Estonia","Total","55 to 74 years",2021,5.4000000000000006E-2]
[null,"Estonia","Total","55 to 74 years",2022,3.9E-2]
[null,"Estonia","Total","55 to 74 years",2023,5.2000000000000005E-2]
[null,"Estonia","Total","55 to 74 years",2024,5.4000000000000006E-2]
[null,"Finland","Total","55 to 74 years",2010,6.2E-2]
[null,"Finland","Total","55 to 74 years",2011,6.0999999999999999E-2]
[null,"Finland","Total","55 to 74 years",2012,6.2E-2]
[null,"Finland","Total","55 to 74 years",2013,6.5000000000000002E-2]
[null,"Finland","Total","55 to 74 years",2014,6.7000000000000004E-2]
[null,"Finland","Total","55 to 74 years",2015,7.2000000000000008E-2]
[null,"Finland","Total","55 to 74 years",2016,6.9000000000000006E-2]
[null,"Finland","Total","55 to 74 years",2017,7.0999999999999994E-2]
[null,"Finland","Total","55 to 74 years",2018,6.3E-2]
[null,"Finland","Total","55 to 74 years",2019,6.0999999999999999E-2]
[null,"Finland","Total","55 to 74 years",2020,6.6000000000000003E-2]
[null,"Finland","Total","55 to 74 years",2021,6.8000000000000005E-2]
[null,"Finland","Total","55 to 74 years",2022,6.7000000000000004E-2]
[null,"Finland","Total","55 to 74 years",2023,6.8000000000000005E-2]
[null,"Finland","Total","55 to 74 years",2024,7.0999999999999994E-2]
[null,"France","Total","55 to 74 years",2010,5.7999999999999996E-2]
[null,"France","Total","55 to 74 years",2011,5.7000000000000002E-2]
[null,"France","Total","55 to 74 years",2012,6.0999999999999999E-2]
[null,"France","Total","55 to 74 years",2013,6.9000000000000006E-2]
[null,"France","Total","55 to 74 years",2014,7.2000000000000008E-2]
[null,"France","Total","55 to 74 years",2015,7.0999999999999994E-2]
[null,"France","Total","55 to 74 years",2016,6.9000000000000006E-2]
[null,"France","Total","55 to 74 years",2017,6.4000000000000001E-2]
[null,"France","Total","55 to 74 years",2018,6.5000000000000002E-2]
[null,"France","Total","55 to 74 years",2019,6.5000000000000002E-2]
[null,"France","Total","55 to 74 years",2020,5.5999999999999994E-2]
[null,"France","Total","55 to 74 years",2021,6.0999999999999999E-2]
[null,"France","Total","55 to 74 years",2022,5.5999999999999994E-2]
[null,"France","Total","55 to 74 years",2023,5.2000000000000005E-2]
[null,"France","Total","55 to 74 years",2024,5.0999999999999997E-2]
[null,"Germany","Total","55 to 74 years",2010,6.5000000000000002E-2]
[null,"Germany","Total","55 to 74 years",2011,5.5E-2]
[null,"Germany","Total","55 to 74 years",2012,0.05]
[null,"Germany","Total","55 to 74 years",2013,4.8000000000000001E-2]
[null,"Germany","Total","55 to 74 years",2014,4.2999999999999997E-2]
[null,"Germany","Total","55 to 74 years",2015,0.04]
[null,"Germany","Total","55 to 74 years",2016,3.3000000000000002E-2]
[null,"Germany","Total","55 to 74 years",2017,2.8999999999999998E-2]
[null,"Germany","Total","55 to 74 years",2018,2.4E-2]
[null,"Germany","Total","55 to 74 years",2019,2.3E-2]
[null,"Germany","Total","55 to 74 years",2020,2.6000000000000002E-2]
[null,"Germany","Total","55 to 74 years",2021,2.8999999999999998E-2]
[null,"Germany","Total","55 to 74 years",2022,2.5000000000000001E-2]
[null,"Germany","Total","55 to 74 years",2023,2.2000000000000002E-2]
[null,"Germany","Total","55 to 74 years",2024,2.2000000000000002E-2]
[null,"Greece","Total","55 to 74 years",2010,5.7999999999999996E-2]
[null,"Greece","Total","55 to 74 years",2011,7.9000000000000001E-2]
[null,"Greece","Total","55 to 74 years",2012,0.129]
[null,"Greece","Total","55 to 74 years",2013,0.159]
[null,"Greece","Total","55 to 74 years",2014,0.16800000000000001]
[null,"Greece","Total","55 to 74 years",2015,0.16899999999999998]
[null,"Greece","Total","55 to 74 years",2016,0.18899999999999997]
[null,"Greece","Total","55 to 74 years",2017,0.17800000000000002]
[null,"Greece","Total","55 to 74 years",2018,0.152]
[null,"Greece","Total","55 to 74 years",2019,0.13500000000000001]
[null,"Greece","Total","55 to 74 years",2020,0.128]
[null,"Greece","Total","55 to 74 years",2021,0.10800000000000001]
[null,"Greece","Total","55 to 74 years",2022,0.09]
[null,"Greece","Total","55 to 74 years",2023,6.9000000000000006E-2]
[null,"Greece","Total","55 to 74 years",2024,7.0999999999999994E-2]
[null,"Hungary","Total","55 to 74 years",2010,7.4999999999999997E-2]
[null,"Hungary","Total","55 to 74 years",2011,8.6999999999999994E-2]
[null,"Hungary","Total","55 to 74 years",2012,8.1000000000000003E-2]
[null,"Hungary","Total","55 to 74 years",2013,7.6999999999999999E-2]
[null,"Hungary","Total","55 to 74 years",2014,6.2E-2]
[null,"Hungary","Total","55 to 74 years",2015,5.5999999999999994E-2]
[null,"Hungary","Total","55 to 74 years",2016,4.2000000000000003E-2]
[null,"Hungary","Total","55 to 74 years",2017,3.4000000000000002E-2]
[null,"Hungary","Total","55 to 74 years",2018,2.4E-2]
[null,"Hungary","Total","55 to 74 years",2019,2.1000000000000001E-2]
[null,"Hungary","Total","55 to 74 years",2020,2.8999999999999998E-2]
[null,"Hungary","Total","55 to 74 years",2021,2.8999999999999998E-2]
[null,"Hungary","Total","55 to 74 years",2022,0.03]
[null,"Hungary","Total","55 to 74 years",2023,3.1E-2]
[null,"Hungary","Total","55 to 74 years",2024,3.5000000000000003E-2]
[null,"Ireland","Total","55 to 74 years",2010,7.9000000000000001E-2]
[null,"Ireland","Total","55 to 74 years",2011,8.5999999999999993E-2]
[null,"Ireland","Total","55 to 74 years",2012,9.4E-2]
[null,"Ireland","Total","55 to 74 years",2013,9.6000000000000002E-2]
[null,"Ireland","Total","55 to 74 years",2014,8.5000000000000006E-2]
[null,"Ireland","Total","55 to 74 years",2015,7.0000000000000007E-2]
[null,"Ireland","Total","55 to 74 years",2016,5.7999999999999996E-2]
[null,"Ireland","Total","55 to 74 years",2017,5.2000000000000005E-2]
[null,"Ireland","Total","55 to 74 years",2018,4.0999999999999995E-2]
[null,"Ireland","Total","55 to 74 years",2019,3.2000000000000001E-2]
[null,"Ireland","Total","55 to 74 years",2020,3.7999999999999999E-2]
[null,"Ireland","Total","55 to 74 years",2021,0.05]
[null,"Ireland","Total","55 to 74 years",2022,0.03]
[null,"Ireland","Total","55 to 74 years",2023,2.7999999999999997E-2]
[null,"Ireland","Total","55 to 74 years",2024,2.7999999999999997E-2]
[null,"Italy","Total","55 to 74 years",2010,3.4000000000000002E-2]
[null,"Italy","Total","55 to 74 years",2011,3.7000000000000005E-2]
[null,"Italy","Total","55 to 74 years",2012,0.05]
[null,"Italy","Total","55 to 74 years",2013,5.4000000000000006E-2]
[null,"Italy","Total","55 to 74 years",2014,5.0999999999999997E-2]
[null,"Italy","Total","55 to 74 years",2015,5.2000000000000005E-2]
[null,"Italy","Total","55 to 74 years",2016,5.4000000000000006E-2]
[null,"Italy","Total","55 to 74 years",2017,5.4000000000000006E-2]
[null,"Italy","Total","55 to 74 years",2018,5.2999999999999999E-2]
[null,"Italy","Total","55 to 74 years",2019,5.0999999999999997E-2]
[null,"Italy","Total","55 to 74 years",2020,4.8000000000000001E-2]
[null,"Italy","Total","55 to 74 years",2021,5.2000000000000005E-2]
[null,"Italy","Total","55 to 74 years",2022,4.5999999999999999E-2]
[null,"Italy","Total","55 to 74 years",2023,4.4000000000000004E-2]
[null,"Italy","Total","55 to 74 years",2024,3.6000000000000004E-2]
[null,"Latvia","Total","55 to 74 years",2010,0.14599999999999999]
[null,"Latvia","Total","55 to 74 years",2011,0.13400000000000001]
[null,"Latvia","Total","55 to 74 years",2012,0.13200000000000001]
[null,"Latvia","Total","55 to 74 years",2013,9.5000000000000001E-2]
[null,"Latvia","Total","55 to 74 years",2014,8.8000000000000009E-2]
[null,"Latvia","Total","55 to 74 years",2015,8.4000000000000005E-2]
[null,"Latvia","Total","55 to 74 years",2016,8.199999999999999E-2]
[null,"Latvia","Total","55 to 74 years",2017,7.4999999999999997E-2]
[null,"Latvia","Total","55 to 74 years",2018,6.8000000000000005E-2]
[null,"Latvia","Total","55 to 74 years",2019,5.7999999999999996E-2]
[null,"Latvia","Total","55 to 74 years",2020,6.9000000000000006E-2]
[null,"Latvia","Total","55 to 74 years",2021,5.2000000000000005E-2]
[null,"Latvia","Total","55 to 74 years",2022,0.05]
[null,"Latvia","Total","55 to 74 years",2023,5.2000000000000005E-2]
[null,"Latvia","Total","55 to 74 years",2024,5.2000000000000005E-2]
[null,"Lithuania","Total","55 to 74 years",2010,0.13100000000000001]
[null,"Lithuania","Total","55 to 74 years",2011,0.12]
[null,"Lithuania","Total","55 to 74 years",2012,0.106]
[null,"Lithuania","Total","55 to 74 years",2013,0.10199999999999999]
[null,"Lithuania","Total","55 to 74 years",2014,9.8000000000000004E-2]
[null,"Lithuania","Total","55 to 74 years",2015,7.9000000000000001E-2]
[null,"Lithuania","Total","55 to 74 years",2016,7.0000000000000007E-2]
[null,"Lithuania","Total","55 to 74 years",2017,6.5000000000000002E-2]
[null,"Lithuania","Total","55 to 74 years",2018,6.4000000000000001E-2]
[null,"Lithuania","Total","55 to 74 years",2019,0.06]
[null,"Lithuania","Total","55 to 74 years",2020,8.5000000000000006E-2]
[null,"Lithuania","Total","55 to 74 years",2021,7.0000000000000007E-2]
[null,"Lithuania","Total","55 to 74 years",2022,5.9000000000000004E-2]
[null,"Lithuania","Total","55 to 74 years",2023,7.0000000000000007E-2]
[null,"Lithuania","Total","55 to 74 years",2024,7.2999999999999995E-2]
[null,"Luxembourg","Total","55 to 74 years",2010,2.2000000000000002E-2]
[null,"Luxembourg","Total","55 to 74 years",2011,2.7000000000000003E-2]
[null,"Luxembourg","Total","55 to 74 years",2012,0.02]
[null,"Luxembourg","Total","55 to 74 years",2013,4.2999999999999997E-2]
[null,"Luxembourg","Total","55 to 74 years",2014,4.2000000000000003E-2]
[null,"Luxembourg","Total","55 to 74 years",2015,4.5999999999999999E-2]
[null,"Luxembourg","Total","55 to 74 years",2016,4.9000000000000002E-2]
[null,"Luxembourg","Total","55 to 74 years",2017,3.5000000000000003E-2]
[null,"Luxembourg","Total","55 to 74 years",2018,3.5000000000000003E-2]
[null,"Luxembourg","Total","55 to 74 years",2019,4.0999999999999995E-2]
[null,"Luxembourg","Total","55 to 74 years",2020,4.0999999999999995E-2]
[null,"Luxembourg","Total","55 to 74 years",2021,4.2999999999999997E-2]
[null,"Luxembourg","Total","55 to 74 years",2022,4.4999999999999998E-2]
[null,"Luxembourg","Total","55 to 74 years",2023]
[null,"Luxembourg","Total","55 to 74 years",2024]
[null,"Malta","Total","55 to 74 years",2010,3.9E-2]
[null,"Malta","Total","55 to 74 years",2011,2.7999999999999997E-2]
[null,"Malta","Total","55 to 74 years",2012,0.04]
[null,"Malta","Total","55 to 74 years",2013,4.8000000000000001E-2]
[null,"Malta","Total","55 to 74 years",2014,5.5E-2]
[null,"Malta","Total","55 to 74 years",2015,0.05]
[null,"Malta","Total","55 to 74 years",2016,3.4000000000000002E-2]
[null,"Malta","Total","55 to 74 years",2017,2.3E-2]
[null,"Malta","Total","55 to 74 years",2018,3.4000000000000002E-2]
[null,"Malta","Total","55 to 74 years",2019,1.3000000000000001E-2]
[null,"Malta","Total","55 to 74 years",2020,3.6000000000000004E-2]
[null,"Malta","Total","55 to 74 years",2021,3.4000000000000002E-2]
[null,"Malta","Total","55 to 74 years",2022,1.9E-2]
[null,"Malta","Total","55 to 74 years",2023]
[null,"Malta","Total","55 to 74 years",2024,2.3E-2]
[null,"Netherlands","Total","55 to 74 years",2010,5.2999999999999999E-2]
[null,"Netherlands","Total","55 to 74 years",2011,5.7000000000000002E-2]
[null,"Netherlands","Total","55 to 74 years",2012,6.2E-2]
[null,"Netherlands","Total","55 to 74 years",2013,7.5999999999999998E-2]
[null,"Netherlands","Total","55 to 74 years",2014,8.5000000000000006E-2]
[null,"Netherlands","Total","55 to 74 years",2015,8.6999999999999994E-2]
[null,"Netherlands","Total","55 to 74 years",2016,7.8E-2]
[null,"Netherlands","Total","55 to 74 years",2017,6.3E-2]
[null,"Netherlands","Total","55 to 74 years",2018,5.2999999999999999E-2]
[null,"Netherlands","Total","55 to 74 years",2019,4.2000000000000003E-2]
[null,"Netherlands","Total","55 to 74 years",2020,3.5000000000000003E-2]
[null,"Netherlands","Total","55 to 74 years",2021,3.4000000000000002E-2]
[null,"Netherlands","Total","55 to 74 years",2022,3.1E-2]
[null,"Netherlands","Total","55 to 74 years",2023,2.5000000000000001E-2]
[null,"Netherlands","Total","55 to 74 years",2024,2.4E-2]
[null,"Poland","Total","55 to 74 years",2010,7.2999999999999995E-2]
[null,"Poland","Total","55 to 74 years",2011,7.0000000000000007E-2]
[null,"Poland","Total","55 to 74 years",2012,7.4999999999999997E-2]
[null,"Poland","Total","55 to 74 years",2013,7.6999999999999999E-2]
[null,"Poland","Total","55 to 74 years",2014,6.7000000000000004E-2]
[null,"Poland","Total","55 to 74 years",2015,5.4000000000000006E-2]
[null,"Poland","Total","55 to 74 years",2016,4.2999999999999997E-2]
[null,"Poland","Total","55 to 74 years",2017,3.5000000000000003E-2]
[null,"Poland","Total","55 to 74 years",2018,2.6000000000000002E-2]
[null,"Poland","Total","55 to 74 years",2019,2.2000000000000002E-2]
[null,"Poland","Total","55 to 74 years",2020,0.02]
[null,"Poland","Total","55 to 74 years",2021,2.2000000000000002E-2]
[null,"Poland","Total","55 to 74 years",2022,1.7000000000000001E-2]
[null,"Poland","Total","55 to 74 years",2023,1.7000000000000001E-2]
[null,"Poland","Total","55 to 74 years",2024,1.9E-2]
[null,"Portugal","Total","55 to 74 years",2010,9.3000000000000013E-2]
[null,"Portugal","Total","55 to 74 years",2011,0.111]
[null,"Portugal","Total","55 to 74 years",2012,0.13200000000000001]
[null,"Portugal","Total","55 to 74 years",2013,0.13900000000000001]
[null,"Portugal","Total","55 to 74 years",2014,0.13400000000000001]
[null,"Portugal","Total","55 to 74 years",2015,0.12300000000000001]
[null,"Portugal","Total","55 to 74 years",2016,0.107]
[null,"Portugal","Total","55 to 74 years",2017,8.4000000000000005E-2]
[null,"Portugal","Total","55 to 74 years",2018,6.3E-2]
[null,"Portugal","Total","55 to 74 years",2019,5.9000000000000004E-2]
[null,"Portugal","Total","55 to 74 years",2020,5.5999999999999994E-2]
[null,"Portugal","Total","55 to 74 years",2021,5.0999999999999997E-2]
[null,"Portugal","Total","55 to 74 years",2022,4.5999999999999999E-2]
[null,"Portugal","Total","55 to 74 years",2023,5.0999999999999997E-2]
[null,"Portugal","Total","55 to 74 years",2024,0.05]
[null,"Romania","Total","55 to 74 years",2010,4.9000000000000002E-2]
[null,"Romania","Total","55 to 74 years",2011,5.2000000000000005E-2]
[null,"Romania","Total","55 to 74 years",2012,4.8000000000000001E-2]
[null,"Romania","Total","55 to 74 years",2013,5.0999999999999997E-2]
[null,"Romania","Total","55 to 74 years",2014,4.5999999999999999E-2]
[null,"Romania","Total","55 to 74 years",2015,4.9000000000000002E-2]
[null,"Romania","Total","55 to 74 years",2016,4.0999999999999995E-2]
[null,"Romania","Total","55 to 74 years",2017,0.04]
[null,"Romania","Total","55 to 74 years",2018,3.3000000000000002E-2]
[null,"Romania","Total","55 to 74 years",2019,0.03]
[null,"Romania","Total","55 to 74 years",2020,4.0999999999999995E-2]
[null,"Romania","Total","55 to 74 years",2021,3.7999999999999999E-2]
[null,"Romania","Total","55 to 74 years",2022,3.6000000000000004E-2]
[null,"Romania","Total","55 to 74 years",2023,3.9E-2]
[null,"Romania","Total","55 to 74 years",2024,2.5000000000000001E-2]
[null,"Slovakia","Total","55 to 74 years",2010,9.9000000000000005E-2]
[null,"Slovakia","Total","55 to 74 years",2011,9.6999999999999989E-2]
[null,"Slovakia","Total","55 to 74 years",2012,0.109]
[null,"Slovakia","Total","55 to 74 years",2013,0.10800000000000001]
[null,"Slovakia","Total","55 to 74 years",2014,0.10400000000000001]
[null,"Slovakia","Total","55 to 74 years",2015,0.09]
[null,"Slovakia","Total","55 to 74 years",2016,8.5999999999999993E-2]
[null,"Slovakia","Total","55 to 74 years",2017,5.7999999999999996E-2]
[null,"Slovakia","Total","55 to 74 years",2018,4.9000000000000002E-2]
[null,"Slovakia","Total","55 to 74 years",2019,4.2999999999999997E-2]
[null,"Slovakia","Total","55 to 74 years",2020,4.4999999999999998E-2]
[null,"Slovakia","Total","55 to 74 years",2021,0.05]
[null,"Slovakia","Total","55 to 74 years",2022,4.2999999999999997E-2]
[null,"Slovakia","Total","55 to 74 years",2023,3.6000000000000004E-2]
[null,"Slovakia","Total","55 to 74 years",2024,3.1E-2]
[null,"Slovenia","Total","55 to 74 years",2010,3.3000000000000002E-2]
[null,"Slovenia","Total","55 to 74 years",2011,5.2999999999999999E-2]
[null,"Slovenia","Total","55 to 74 years",2012,5.5E-2]
[null,"Slovenia","Total","55 to 74 years",2013,6.2E-2]
[null,"Slovenia","Total","55 to 74 years",2014,6.7000000000000004E-2]
[null,"Slovenia","Total","55 to 74 years",2015,7.0000000000000007E-2]
[null,"Slovenia","Total","55 to 74 years",2016,0.06]
[null,"Slovenia","Total","55 to 74 years",2017,5.7999999999999996E-2]
[null,"Slovenia","Total","55 to 74 years",2018,4.4000000000000004E-2]
[null,"Slovenia","Total","55 to 74 years",2019,4.2000000000000003E-2]
[null,"Slovenia","Total","55 to 74 years",2020,3.5000000000000003E-2]
[null,"Slovenia","Total","55 to 74 years",2021,3.9E-2]
[null,"Slovenia","Total","55 to 74 years",2022,3.9E-2]
[null,"Slovenia","Total","55 to 74 years",2023,3.7999999999999999E-2]
[null,"Slovenia","Total","55 to 74 years",2024,3.6000000000000004E-2]
[null,"Spain","Total","55 to 74 years",2010,0.13600000000000001]
[null,"Spain","Total","55 to 74 years",2011,0.14499999999999999]
[null,"Spain","Total","55 to 74 years",2012,0.17300000000000001]
[null,"Spain","Total","55 to 74 years",2013,0.19399999999999998]
[null,"Spain","Total","55 to 74 years",2014,0.19399999999999998]
[null,"Spain","Total","55 to 74 years",2015,0.18]
[null,"Spain","Total","55 to 74 years",2016,0.16500000000000001]
[null,"Spain","Total","55 to 74 years",2017,0.14800000000000002]
[null,"Spain","Total","55 to 74 years",2018,0.13300000000000001]
[null,"Spain","Total","55 to 74 years",2019,0.12300000000000001]
[null,"Spain","Total","55 to 74 years",2020,0.121]
[null,"Spain","Total","55 to 74 years",2021,0.129]
[null,"Spain","Total","55 to 74 years",2022,0.114]
[null,"Spain","Total","55 to 74 years",2023,0.111]
[null,"Spain","Total","55 to 74 years",2024,0.10300000000000001]
[null,"Sweden","Total","55 to 74 years",2010,5.4000000000000006E-2]
[null,"Sweden","Total","55 to 74 years",2011,4.9000000000000002E-2]
[null,"Sweden","Total","55 to 74 years",2012,4.9000000000000002E-2]
[null,"Sweden","Total","55 to 74 years",2013,4.7E-2]
[null,"Sweden","Total","55 to 74 years",2014,0.05]
[null,"Sweden","Total","55 to 74 years",2015,4.9000000000000002E-2]
[null,"Sweden","Total","55 to 74 years",2016,4.8000000000000001E-2]
[null,"Sweden","Total","55 to 74 years",2017,4.7E-2]
[null,"Sweden","Total","55 to 74 years",2018,4.2000000000000003E-2]
[null,"Sweden","Total","55 to 74 years",2019,4.2999999999999997E-2]
[null,"Sweden","Total","55 to 74 years",2020,5.2999999999999999E-2]
[null,"Sweden","Total","55 to 74 years",2021,6.4000000000000001E-2]
[null,"Sweden","Total","55 to 74 years",2022,5.2000000000000005E-2]
[null,"Sweden","Total","55 to 74 years",2023,5.0999999999999997E-2]
[null,"Sweden","Total","55 to 74 years",2024,5.7000000000000002E-2]
[null,"Austria","Females","15 to 24 years",2010,9.8000000000000004E-2]
[null,"Austria","Females","15 to 24 years",2011,9.5000000000000001E-2]
[null,"Austria","Females","15 to 24 years",2012,9.6000000000000002E-2]
[null,"Austria","Females","15 to 24 years",2013,0.10400000000000001]
[null,"Austria","Females","15 to 24 years",2014,0.10400000000000001]
[null,"Austria","Females","15 to 24 years",2015,0.10400000000000001]
[null,"Austria","Females","15 to 24 years",2016,0.107]
[null,"Austria","Females","15 to 24 years",2017,9.0999999999999998E-2]
[null,"Austria","Females","15 to 24 years",2018,9.8000000000000004E-2]
[null,"Austria","Females","15 to 24 years",2019,8.1000000000000003E-2]
[null,"Austria","Females","15 to 24 years",2020,0.106]
[null,"Austria","Females","15 to 24 years",2021,0.113]
[null,"Austria","Females","15 to 24 years",2022,9.5000000000000001E-2]
[null,"Austria","Females","15 to 24 years",2023,0.107]
[null,"Austria","Females","15 to 24 years",2024,0.10099999999999999]
[null,"Belgium","Females","15 to 24 years",2010,0.22399999999999998]
[null,"Belgium","Females","15 to 24 years",2011,0.18899999999999997]
[null,"Belgium","Females","15 to 24 years",2012,0.19]
[null,"Belgium","Females","15 to 24 years",2013,0.22500000000000001]
[null,"Belgium","Females","15 to 24 years",2014,0.22500000000000001]
[null,"Belgium","Females","15 to 24 years",2015,0.20499999999999999]
[null,"Belgium","Females","15 to 24 years",2016,0.183]
[null,"Belgium","Females","15 to 24 years",2017,0.182]
[null,"Belgium","Females","15 to 24 years",2018,0.153]
[null,"Belgium","Females","15 to 24 years",2019,0.12300000000000001]
[null,"Belgium","Females","15 to 24 years",2020,0.156]
[null,"Belgium","Females","15 to 24 years",2021,0.16200000000000001]
[null,"Belgium","Females","15 to 24 years",2022,0.14400000000000002]
[null,"Belgium","Females","15 to 24 years",2023,0.14400000000000002]
[null,"Belgium","Females","15 to 24 years",2024,0.14800000000000002]
[null,"Bulgaria","Females","15 to 24 years",2010,0.24399999999999999]
[null,"Bulgaria","Females","15 to 24 years",2011,0.28100000000000003]
[null,"Bulgaria","Females","15 to 24 years",2012,0.30599999999999999]
[null,"Bulgaria","Females","15 to 24 years",2013,0.30299999999999999]
[null,"Bulgaria","Females","15 to 24 years",2014,0.28300000000000003]
[null,"Bulgaria","Females","15 to 24 years",2015,0.26700000000000002]
[null,"Bulgaria","Females","15 to 24 years",2016,0.21100000000000002]
[null,"Bulgaria","Females","15 to 24 years",2017,0.16300000000000001]
[null,"Bulgaria","Females","15 to 24 years",2018,0.157]
[null,"Bulgaria","Females","15 to 24 years",2019,0.11800000000000001]
[null,"Bulgaria","Females","15 to 24 years",2020,0.17699999999999999]
[null,"Bulgaria","Females","15 to 24 years",2021,0.151]
[null,"Bulgaria","Females","15 to 24 years",2022,0.10400000000000001]
[null,"Bulgaria","Females","15 to 24 years",2023,0.111]
[null,"Bulgaria","Females","15 to 24 years",2024,0.11699999999999999]
[null,"Croatia","Females","15 to 24 years",2010,0.33600000000000002]
[null,"Croatia","Females","15 to 24 years",2011,0.36099999999999999]
[null,"Croatia","Females","15 to 24 years",2012,0.42299999999999999]
[null,"Croatia","Females","15 to 24 years",2013,0.51]
[null,"Croatia","Females","15 to 24 years",2014,0.46600000000000003]
[null,"Croatia","Females","15 to 24 years",2015,0.435]
[null,"Croatia","Females","15 to 24 years",2016,0.31]
[null,"Croatia","Females","15 to 24 years",2017,0.27200000000000002]
[null,"Croatia","Females","15 to 24 years",2018,0.29100000000000004]
[null,"Croatia","Females","15 to 24 years",2019,0.188]
[null,"Croatia","Females","15 to 24 years",2020,0.23899999999999999]
[null,"Croatia","Females","15 to 24 years",2021,0.26300000000000001]
[null,"Croatia","Females","15 to 24 years",2022,0.221]
[null,"Croatia","Females","15 to 24 years",2023,0.21899999999999997]
[null,"Croatia","Females","15 to 24 years",2024,0.182]
[null,"Cyprus","Females","15 to 24 years",2010,0.17199999999999999]
[null,"Cyprus","Females","15 to 24 years",2011,0.215]
[null,"Cyprus","Females","15 to 24 years",2012,0.26700000000000002]
[null,"Cyprus","Females","15 to 24 years",2013,0.36799999999999999]
[null,"Cyprus","Females","15 to 24 years",2014,0.34600000000000003]
[null,"Cyprus","Females","15 to 24 years",2015,0.311]
[null,"Cyprus","Females","15 to 24 years",2016,0.318]
[null,"Cyprus","Females","15 to 24 years",2017,0.22899999999999998]
[null,"Cyprus","Females","15 to 24 years",2018,0.16200000000000001]
[null,"Cyprus","Females","15 to 24 years",2019,0.151]
[null,"Cyprus","Females","15 to 24 years",2020,0.11699999999999999]
[null,"Cyprus","Females","15 to 24 years",2021,0.161]
[null,"Cyprus","Females","15 to 24 years",2022,0.18]
[null,"Cyprus","Females","15 to 24 years",2023,0.14699999999999999]
[null,"Cyprus","Females","15 to 24 years",2024,0.13600000000000001]
[null,"Czechia","Females","15 to 24 years",2010,0.185]
[null,"Czechia","Females","15 to 24 years",2011,0.18]
[null,"Czechia","Females","15 to 24 years",2012,0.19]
[null,"Czechia","Females","15 to 24 years",2013,0.19399999999999998]
[null,"Czechia","Females","15 to 24 years",2014,0.17100000000000001]
[null,"Czechia","Females","15 to 24 years",2015,0.14400000000000002]
[null,"Czechia","Females","15 to 24 years",2016,0.114]
[null,"Czechia","Females","15 to 24 years",2017,8.6999999999999994E-2]
[null,"Czechia","Females","15 to 24 years",2018,7.2000000000000008E-2]
[null,"Czechia","Females","15 to 24 years",2019,0.06]
[null,"Czechia","Females","15 to 24 years",2020,9.1999999999999998E-2]
[null,"Czechia","Females","15 to 24 years",2021,9.0999999999999998E-2]
[null,"Czechia","Females","15 to 24 years",2022,7.9000000000000001E-2]
[null,"Czechia","Females","15 to 24 years",2023,8.8000000000000009E-2]
[null,"Czechia","Females","15 to 24 years",2024,9.9000000000000005E-2]
[null,"Denmark","Females","15 to 24 years",2010,0.13200000000000001]
[null,"Denmark","Females","15 to 24 years",2011,0.14400000000000002]
[null,"Denmark","Females","15 to 24 years",2012,0.14800000000000002]
[null,"Denmark","Females","15 to 24 years",2013,0.13300000000000001]
[null,"Denmark","Females","15 to 24 years",2014,0.129]
[null,"Denmark","Females","15 to 24 years",2015,0.111]
[null,"Denmark","Females","15 to 24 years",2016,0.10800000000000001]
[null,"Denmark","Females","15 to 24 years",2017,0.11900000000000001]
[null,"Denmark","Females","15 to 24 years",2018,9.1999999999999998E-2]
[null,"Denmark","Females","15 to 24 years",2019,9.6999999999999989E-2]
[null,"Denmark","Females","15 to 24 years",2020,0.107]
[null,"Denmark","Females","15 to 24 years",2021,0.11]
[null,"Denmark","Females","15 to 24 years",2022,0.105]
[null,"Denmark","Females","15 to 24 years",2023,0.113]
[null,"Denmark","Females","15 to 24 years",2024,0.14199999999999999]
[null,"Estonia","Females","15 to 24 years",2010,0.28800000000000003]
[null,"Estonia","Females","15 to 24 years",2011,0.20300000000000001]
[null,"Estonia","Females","15 to 24 years",2012,0.182]
[null,"Estonia","Females","15 to 24 years",2013,0.19600000000000001]
[null,"Estonia","Females","15 to 24 years",2014,9.9000000000000005E-2]
[null,"Estonia","Females","15 to 24 years",2015,0.129]
[null,"Estonia","Females","15 to 24 years",2016,0.10400000000000001]
[null,"Estonia","Females","15 to 24 years",2017,9.3000000000000013E-2]
[null,"Estonia","Females","15 to 24 years",2018,0.111]
[null,"Estonia","Females","15 to 24 years",2019,0.12]
[null,"Estonia","Females","15 to 24 years",2020,0.183]
[null,"Estonia","Females","15 to 24 years",2021,0.15]
[null,"Estonia","Females","15 to 24 years",2022,0.16500000000000001]
[null,"Estonia","Females","15 to 24 years",2023,0.16399999999999998]
[null,"Estonia","Females","15 to 24 years",2024,0.193]
[null,"Finland","Females","15 to 24 years",2010,0.19399999999999998]
[null,"Finland","Females","15 to 24 years",2011,0.184]
[null,"Finland","Females","15 to 24 years",2012,0.182]
[null,"Finland","Females","15 to 24 years",2013,0.17399999999999999]
[null,"Finland","Females","15 to 24 years",2014,0.17899999999999999]
[null,"Finland","Females","15 to 24 years",2015,0.191]
[null,"Finland","Females","15 to 24 years",2016,0.18899999999999997]
[null,"Finland","Females","15 to 24 years",2017,0.191]
[null,"Finland","Females","15 to 24 years",2018,0.17]
[null,"Finland","Females","15 to 24 years",2019,0.159]
[null,"Finland","Females","15 to 24 years",2020,0.192]
[null,"Finland","Females","15 to 24 years",2021,0.16399999999999998]
[null,"Finland","Females","15 to 24 years",2022,0.14000000000000001]
[null,"Finland","Females","15 to 24 years",2023,0.154]
[null,"Finland","Females","15 to 24 years",2024,0.18]
[null,"France","Females","15 to 24 years",2010,0.27800000000000002]
[null,"France","Females","15 to 24 years",2011,0.27300000000000002]
[null,"France","Females","15 to 24 years",2012,0.27899999999999997]
[null,"France","Females","15 to 24 years",2013,0.29499999999999998]
[null,"France","Females","15 to 24 years",2014,0.27200000000000002]
[null,"France","Females","15 to 24 years",2015,0.27399999999999997]
[null,"France","Females","15 to 24 years",2016,0.28000000000000003]
[null,"France","Females","15 to 24 years",2017,0.249]
[null,"France","Females","15 to 24 years",2018,0.23499999999999999]
[null,"France","Females","15 to 24 years",2019,0.21600000000000003]
[null,"France","Females","15 to 24 years",2020,0.23499999999999999]
[null,"France","Females","15 to 24 years",2021,0.188]
[null,"France","Females","15 to 24 years",2022,0.16]
[null,"France","Females","15 to 24 years",2023,0.161]
[null,"France","Females","15 to 24 years",2024,0.184]
[null,"Germany","Females","15 to 24 years",2010,9.4E-2]
[null,"Germany","Females","15 to 24 years",2011,8.4000000000000005E-2]
[null,"Germany","Females","15 to 24 years",2012,7.8E-2]
[null,"Germany","Females","15 to 24 years",2013,7.5999999999999998E-2]
[null,"Germany","Females","15 to 24 years",2014,7.5999999999999998E-2]
[null,"Germany","Females","15 to 24 years",2015,6.9000000000000006E-2]
[null,"Germany","Females","15 to 24 years",2016,6.6000000000000003E-2]
[null,"Germany","Females","15 to 24 years",2017,6.2E-2]
[null,"Germany","Females","15 to 24 years",2018,5.5E-2]
[null,"Germany","Females","15 to 24 years",2019,5.0999999999999997E-2]
[null,"Germany","Females","15 to 24 years",2020,7.2999999999999995E-2]
[null,"Germany","Females","15 to 24 years",2021,6.5000000000000002E-2]
[null,"Germany","Females","15 to 24 years",2022,5.5E-2]
[null,"Germany","Females","15 to 24 years",2023,5.2999999999999999E-2]
[null,"Germany","Females","15 to 24 years",2024,5.9000000000000004E-2]
[null,"Greece","Females","15 to 24 years",2010,0.41100000000000003]
[null,"Greece","Females","15 to 24 years",2011,0.52100000000000002]
[null,"Greece","Females","15 to 24 years",2012,0.63400000000000001]
[null,"Greece","Females","15 to 24 years",2013,0.64599999999999991]
[null,"Greece","Females","15 to 24 years",2014,0.58499999999999996]
[null,"Greece","Females","15 to 24 years",2015,0.54799999999999993]
[null,"Greece","Females","15 to 24 years",2016,0.52100000000000002]
[null,"Greece","Females","15 to 24 years",2017,0.49]
[null,"Greece","Females","15 to 24 years",2018,0.45399999999999996]
[null,"Greece","Females","15 to 24 years",2019,0.41]
[null,"Greece","Females","15 to 24 years",2020,0.42799999999999999]
[null,"Greece","Females","15 to 24 years",2021,0.40899999999999997]
[null,"Greece","Females","15 to 24 years",2022,0.38799999999999996]
[null,"Greece","Females","15 to 24 years",2023,0.29399999999999998]
[null,"Greece","Females","15 to 24 years",2024,0.24100000000000002]
[null,"Hungary","Females","15 to 24 years",2010,0.23499999999999999]
[null,"Hungary","Females","15 to 24 years",2011,0.23499999999999999]
[null,"Hungary","Females","15 to 24 years",2012,0.26300000000000001]
[null,"Hungary","Females","15 to 24 years",2013,0.26800000000000002]
[null,"Hungary","Females","15 to 24 years",2014,0.20199999999999999]
[null,"Hungary","Females","15 to 24 years",2015,0.155]
[null,"Hungary","Females","15 to 24 years",2016,0.124]
[null,"Hungary","Females","15 to 24 years",2017,0.115]
[null,"Hungary","Females","15 to 24 years",2018,0.1]
[null,"Hungary","Females","15 to 24 years",2019,0.106]
[null,"Hungary","Females","15 to 24 years",2020,0.13500000000000001]
[null,"Hungary","Females","15 to 24 years",2021,0.156]
[null,"Hungary","Females","15 to 24 years",2022,9.6000000000000002E-2]
[null,"Hungary","Females","15 to 24 years",2023,0.12300000000000001]
[null,"Hungary","Females","15 to 24 years",2024,0.14800000000000002]
[null,"Ireland","Females","15 to 24 years",2010,0.20899999999999999]
[null,"Ireland","Females","15 to 24 years",2011,0.223]
[null,"Ireland","Females","15 to 24 years",2012,0.23499999999999999]
[null,"Ireland","Females","15 to 24 years",2013,0.22800000000000001]
[null,"Ireland","Females","15 to 24 years",2014,0.19800000000000001]
[null,"Ireland","Females","15 to 24 years",2015,0.16300000000000001]
[null,"Ireland","Females","15 to 24 years",2016,0.13600000000000001]
[null,"Ireland","Females","15 to 24 years",2017,0.126]
[null,"Ireland","Females","15 to 24 years",2018,0.126]
[null,"Ireland","Females","15 to 24 years",2019,0.106]
[null,"Ireland","Females","15 to 24 years",2020,0.158]
[null,"Ireland","Females","15 to 24 years",2021,0.14599999999999999]
[null,"Ireland","Females","15 to 24 years",2022,9.9000000000000005E-2]
[null,"Ireland","Females","15 to 24 years",2023,0.106]
[null,"Ireland","Females","15 to 24 years",2024,0.10300000000000001]
[null,"Italy","Females","15 to 24 years",2010,0.29399999999999998]
[null,"Italy","Females","15 to 24 years",2011,0.32200000000000001]
[null,"Italy","Females","15 to 24 years",2012,0.376]
[null,"Italy","Females","15 to 24 years",2013,0.41399999999999998]
[null,"Italy","Females","15 to 24 years",2014,0.44600000000000001]
[null,"Italy","Females","15 to 24 years",2015,0.42599999999999999]
[null,"Italy","Females","15 to 24 years",2016,0.39600000000000002]
[null,"Italy","Females","15 to 24 years",2017,0.37200000000000005]
[null,"Italy","Females","15 to 24 years",2018,0.34899999999999998]
[null,"Italy","Females","15 to 24 years",2019,0.311]
[null,"Italy","Females","15 to 24 years",2020,0.32100000000000001]
[null,"Italy","Females","15 to 24 years",2021,0.32799999999999996]
[null,"Italy","Females","15 to 24 years",2022,0.25800000000000001]
[null,"Italy","Females","15 to 24 years",2023,0.252]
[null,"Italy","Females","15 to 24 years",2024,0.222]
[null,"Latvia","Females","15 to 24 years",2010,0.34799999999999998]
[null,"Latvia","Females","15 to 24 years",2011,0.30599999999999999]
[null,"Latvia","Females","15 to 24 years",2012,0.29499999999999998]
[null,"Latvia","Females","15 to 24 years",2013,0.249]
[null,"Latvia","Females","15 to 24 years",2014,0.2]
[null,"Latvia","Females","15 to 24 years",2015,0.14199999999999999]
[null,"Latvia","Females","15 to 24 years",2016,0.124]
[null,"Latvia","Females","15 to 24 years",2017,0.154]
[null,"Latvia","Females","15 to 24 years",2018,0.11800000000000001]
[null,"Latvia","Females","15 to 24 years",2019,0.10099999999999999]
[null,"Latvia","Females","15 to 24 years",2020,0.155]
[null,"Latvia","Females","15 to 24 years",2021,0.14599999999999999]
[null,"Latvia","Females","15 to 24 years",2022,0.10199999999999999]
[null,"Latvia","Females","15 to 24 years",2023,0.1]
[null,"Latvia","Females","15 to 24 years",2024,0.14099999999999999]
[null,"Lithuania","Females","15 to 24 years",2010,0.316]
[null,"Lithuania","Females","15 to 24 years",2011,0.29399999999999998]
[null,"Lithuania","Females","15 to 24 years",2012,0.22699999999999998]
[null,"Lithuania","Females","15 to 24 years",2013,0.20399999999999999]
[null,"Lithuania","Females","15 to 24 years",2014,0.187]
[null,"Lithuania","Females","15 to 24 years",2015,0.16600000000000001]
[null,"Lithuania","Females","15 to 24 years",2016,0.126]
[null,"Lithuania","Females","15 to 24 years",2017,0.11699999999999999]
[null,"Lithuania","Females","15 to 24 years",2018,0.10099999999999999]
[null,"Lithuania","Females","15 to 24 years",2019,9.3000000000000013E-2]
[null,"Lithuania","Females","15 to 24 years",2020,0.17300000000000001]
[null,"Lithuania","Females","15 to 24 years",2021,0.14699999999999999]
[null,"Lithuania","Females","15 to 24 years",2022,0.10400000000000001]
[null,"Lithuania","Females","15 to 24 years",2023,0.10199999999999999]
[null,"Lithuania","Females","15 to 24 years",2024,0.16399999999999998]
[null,"Luxembourg","Females","15 to 24 years",2010,0.10199999999999999]
[null,"Luxembourg","Females","15 to 24 years",2011,0.20800000000000002]
[null,"Luxembourg","Females","15 to 24 years",2012,0.18600000000000003]
[null,"Luxembourg","Females","15 to 24 years",2013,0.109]
[null,"Luxembourg","Females","15 to 24 years",2014,0.18100000000000002]
[null,"Luxembourg","Females","15 to 24 years",2015,0.157]
[null,"Luxembourg","Females","15 to 24 years",2016,0.18]
[null,"Luxembourg","Females","15 to 24 years",2017,0.13200000000000001]
[null,"Luxembourg","Females","15 to 24 years",2018,0.11900000000000001]
[null,"Luxembourg","Females","15 to 24 years",2019,0.16]
[null,"Luxembourg","Females","15 to 24 years",2020,0.21299999999999999]
[null,"Luxembourg","Females","15 to 24 years",2021,0.161]
[null,"Luxembourg","Females","15 to 24 years",2022,0.185]
[null,"Luxembourg","Females","15 to 24 years",2023,0.22699999999999998]
[null,"Luxembourg","Females","15 to 24 years",2024,0.18100000000000002]
[null,"Malta","Females","15 to 24 years",2010,0.11800000000000001]
[null,"Malta","Females","15 to 24 years",2011,0.129]
[null,"Malta","Females","15 to 24 years",2012,0.14499999999999999]
[null,"Malta","Females","15 to 24 years",2013,0.10400000000000001]
[null,"Malta","Females","15 to 24 years",2014,9.5000000000000001E-2]
[null,"Malta","Females","15 to 24 years",2015,9.8000000000000004E-2]
[null,"Malta","Females","15 to 24 years",2016,0.114]
[null,"Malta","Females","15 to 24 years",2017,9.9000000000000005E-2]
[null,"Malta","Females","15 to 24 years",2018,6.7000000000000004E-2]
[null,"Malta","Females","15 to 24 years",2019,8.5999999999999993E-2]
[null,"Malta","Females","15 to 24 years",2020,8.3000000000000004E-2]
[null,"Malta","Females","15 to 24 years",2021,0.06]
[null,"Malta","Females","15 to 24 years",2022,0.06]
[null,"Malta","Females","15 to 24 years",2023]
[null,"Malta","Females","15 to 24 years",2024,8.4000000000000005E-2]
[null,"Netherlands","Females","15 to 24 years",2010,0.107]
[null,"Netherlands","Females","15 to 24 years",2011,0.10199999999999999]
[null,"Netherlands","Females","15 to 24 years",2012,0.12]
[null,"Netherlands","Females","15 to 24 years",2013,0.13]
[null,"Netherlands","Females","15 to 24 years",2014,0.13200000000000001]
[null,"Netherlands","Females","15 to 24 years",2015,0.11599999999999999]
[null,"Netherlands","Females","15 to 24 years",2016,0.10800000000000001]
[null,"Netherlands","Females","15 to 24 years",2017,9.5000000000000001E-2]
[null,"Netherlands","Females","15 to 24 years",2018,7.5999999999999998E-2]
[null,"Netherlands","Females","15 to 24 years",2019,7.2000000000000008E-2]
[null,"Netherlands","Females","15 to 24 years",2020,9.6999999999999989E-2]
[null,"Netherlands","Females","15 to 24 years",2021,0.09]
[null,"Netherlands","Females","15 to 24 years",2022,0.08]
[null,"Netherlands","Females","15 to 24 years",2023,8.199999999999999E-2]
[null,"Netherlands","Females","15 to 24 years",2024,8.5000000000000006E-2]
[null,"Poland","Females","15 to 24 years",2010,0.254]
[null,"Poland","Females","15 to 24 years",2011,0.28600000000000003]
[null,"Poland","Females","15 to 24 years",2012,0.3]
[null,"Poland","Females","15 to 24 years",2013,0.30199999999999999]
[null,"Poland","Females","15 to 24 years",2014,0.25600000000000001]
[null,"Poland","Females","15 to 24 years",2015,0.21]
[null,"Poland","Females","15 to 24 years",2016,0.18100000000000002]
[null,"Poland","Females","15 to 24 years",2017,0.151]
[null,"Poland","Females","15 to 24 years",2018,0.121]
[null,"Poland","Females","15 to 24 years",2019,9.8000000000000004E-2]
[null,"Poland","Females","15 to 24 years",2020,0.114]
[null,"Poland","Females","15 to 24 years",2021,0.12300000000000001]
[null,"Poland","Females","15 to 24 years",2022,0.11199999999999999]
[null,"Poland","Females","15 to 24 years",2023,0.111]
[null,"Poland","Females","15 to 24 years",2024,0.109]
[null,"Portugal","Females","15 to 24 years",2010,0.28699999999999998]
[null,"Portugal","Females","15 to 24 years",2011,0.317]
[null,"Portugal","Females","15 to 24 years",2012,0.39399999999999996]
[null,"Portugal","Females","15 to 24 years",2013,0.40100000000000002]
[null,"Portugal","Females","15 to 24 years",2014,0.35]
[null,"Portugal","Females","15 to 24 years",2015,0.34100000000000003]
[null,"Portugal","Females","15 to 24 years",2016,0.28600000000000003]
[null,"Portugal","Females","15 to 24 years",2017,0.254]
[null,"Portugal","Females","15 to 24 years",2018,0.20399999999999999]
[null,"Portugal","Females","15 to 24 years",2019,0.214]
[null,"Portugal","Females","15 to 24 years",2020,0.24]
[null,"Portugal","Females","15 to 24 years",2021,0.26700000000000002]
[null,"Portugal","Females","15 to 24 years",2022,0.20499999999999999]
[null,"Portugal","Females","15 to 24 years",2023,0.20100000000000001]
[null,"Portugal","Females","15 to 24 years",2024,0.22399999999999998]
[null,"Romania","Females","15 to 24 years",2010,0.28100000000000003]
[null,"Romania","Females","15 to 24 years",2011,0.29499999999999998]
[null,"Romania","Females","15 to 24 years",2012,0.29100000000000004]
[null,"Romania","Females","15 to 24 years",2013,0.311]
[null,"Romania","Females","15 to 24 years",2014,0.311]
[null,"Romania","Females","15 to 24 years",2015,0.29399999999999998]
[null,"Romania","Females","15 to 24 years",2016,0.27300000000000002]
[null,"Romania","Females","15 to 24 years",2017,0.23100000000000001]
[null,"Romania","Females","15 to 24 years",2018,0.20699999999999999]
[null,"Romania","Females","15 to 24 years",2019,0.22]
[null,"Romania","Females","15 to 24 years",2020,0.20800000000000002]
[null,"Romania","Females","15 to 24 years",2021,0.21199999999999999]
[null,"Romania","Females","15 to 24 years",2022,0.249]
[null,"Romania","Females","15 to 24 years",2023,0.222]
[null,"Romania","Females","15 to 24 years",2024,0.251]
[null,"Slovakia","Females","15 to 24 years",2010,0.34799999999999998]
[null,"Slovakia","Females","15 to 24 years",2011,0.36799999999999999]
[null,"Slovakia","Females","15 to 24 years",2012,0.35399999999999998]
[null,"Slovakia","Females","15 to 24 years",2013,0.34399999999999997]
[null,"Slovakia","Females","15 to 24 years",2014,0.32899999999999996]
[null,"Slovakia","Females","15 to 24 years",2015,0.30199999999999999]
[null,"Slovakia","Females","15 to 24 years",2016,0.28899999999999998]
[null,"Slovakia","Females","15 to 24 years",2017,0.223]
[null,"Slovakia","Females","15 to 24 years",2018,0.18]
[null,"Slovakia","Females","15 to 24 years",2019,0.21899999999999997]
[null,"Slovakia","Females","15 to 24 years",2020,0.23399999999999999]
[null,"Slovakia","Females","15 to 24 years",2021,0.22]
[null,"Slovakia","Females","15 to 24 years",2022,0.217]
[null,"Slovakia","Females","15 to 24 years",2023,0.16]
[null,"Slovakia","Females","15 to 24 years",2024,0.18899999999999997]
[null,"Slovenia","Females","15 to 24 years",2010,0.13800000000000001]
[null,"Slovenia","Females","15 to 24 years",2011,0.17]
[null,"Slovenia","Females","15 to 24 years",2012,0.214]
[null,"Slovenia","Females","15 to 24 years",2013,0.23699999999999999]
[null,"Slovenia","Females","15 to 24 years",2014,0.21600000000000003]
[null,"Slovenia","Females","15 to 24 years",2015,0.14800000000000002]
[null,"Slovenia","Females","15 to 24 years",2016,0.14699999999999999]
[null,"Slovenia","Females","15 to 24 years",2017,0.13100000000000001]
[null,"Slovenia","Females","15 to 24 years",2018,9.6000000000000002E-2]
[null,"Slovenia","Females","15 to 24 years",2019,9.1999999999999998E-2]
[null,"Slovenia","Females","15 to 24 years",2020,0.161]
[null,"Slovenia","Females","15 to 24 years",2021,0.14400000000000002]
[null,"Slovenia","Females","15 to 24 years",2022,0.12]
[null,"Slovenia","Females","15 to 24 years",2023,8.6999999999999994E-2]
[null,"Slovenia","Females","15 to 24 years",2024,0.109]
[null,"Spain","Females","15 to 24 years",2010,0.39600000000000002]
[null,"Spain","Females","15 to 24 years",2011,0.44]
[null,"Spain","Females","15 to 24 years",2012,0.51400000000000001]
[null,"Spain","Females","15 to 24 years",2013,0.54600000000000004]
[null,"Spain","Females","15 to 24 years",2014,0.52900000000000003]
[null,"Spain","Females","15 to 24 years",2015,0.48]
[null,"Spain","Females","15 to 24 years",2016,0.44900000000000001]
[null,"Spain","Females","15 to 24 years",2017,0.374]
[null,"Spain","Females","15 to 24 years",2018,0.33299999999999996]
[null,"Spain","Females","15 to 24 years",2019,0.34499999999999997]
[null,"Spain","Females","15 to 24 years",2020,0.39700000000000002]
[null,"Spain","Females","15 to 24 years",2021,0.36200000000000004]
[null,"Spain","Females","15 to 24 years",2022,0.309]
[null,"Spain","Females","15 to 24 years",2023,0.28499999999999998]
[null,"Spain","Females","15 to 24 years",2024,0.27100000000000002]
[null,"Sweden","Females","15 to 24 years",2010,0.23100000000000001]
[null,"Sweden","Females","15 to 24 years",2011,0.217]
[null,"Sweden","Females","15 to 24 years",2012,0.217]
[null,"Sweden","Females","15 to 24 years",2013,0.218]
[null,"Sweden","Females","15 to 24 years",2014,0.20899999999999999]
[null,"Sweden","Females","15 to 24 years",2015,0.19]
[null,"Sweden","Females","15 to 24 years",2016,0.16800000000000001]
[null,"Sweden","Females","15 to 24 years",2017,0.16399999999999998]
[null,"Sweden","Females","15 to 24 years",2018,0.159]
[null,"Sweden","Females","15 to 24 years",2019,0.191]
[null,"Sweden","Females","15 to 24 years",2020,0.22600000000000001]
[null,"Sweden","Females","15 to 24 years",2021,0.24100000000000002]
[null,"Sweden","Females","15 to 24 years",2022,0.23499999999999999]
[null,"Sweden","Females","15 to 24 years",2023,0.21600000000000003]
[null,"Sweden","Females","15 to 24 years",2024,0.23600000000000002]
[null,"Austria","Females","15 to 29 years",2010,8.5999999999999993E-2]
[null,"Austria","Females","15 to 29 years",2011,0.08]
[null,"Austria","Females","15 to 29 years",2012,8.4000000000000005E-2]
[null,"Austria","Females","15 to 29 years",2013,0.09]
[null,"Austria","Females","15 to 29 years",2014,8.8000000000000009E-2]
[null,"Austria","Females","15 to 29 years",2015,8.1000000000000003E-2]
[null,"Austria","Females","15 to 29 years",2016,8.199999999999999E-2]
[null,"Austria","Females","15 to 29 years",2017,7.2999999999999995E-2]
[null,"Austria","Females","15 to 29 years",2018,7.4999999999999997E-2]
[null,"Austria","Females","15 to 29 years",2019,6.7000000000000004E-2]
[null,"Austria","Females","15 to 29 years",2020,8.6999999999999994E-2]
[null,"Austria","Females","15 to 29 years",2021,0.09]
[null,"Austria","Females","15 to 29 years",2022,7.0999999999999994E-2]
[null,"Austria","Females","15 to 29 years",2023,8.199999999999999E-2]
[null,"Austria","Females","15 to 29 years",2024,7.4999999999999997E-2]
[null,"Belgium","Females","15 to 29 years",2010,0.159]
[null,"Belgium","Females","15 to 29 years",2011,0.13500000000000001]
[null,"Belgium","Females","15 to 29 years",2012,0.14599999999999999]
[null,"Belgium","Females","15 to 29 years",2013,0.158]
[null,"Belgium","Females","15 to 29 years",2014,0.15]
[null,"Belgium","Females","15 to 29 years",2015,0.14099999999999999]
[null,"Belgium","Females","15 to 29 years",2016,0.13300000000000001]
[null,"Belgium","Females","15 to 29 years",2017,0.128]
[null,"Belgium","Females","15 to 29 years",2018,0.10800000000000001]
[null,"Belgium","Females","15 to 29 years",2019,8.8000000000000009E-2]
[null,"Belgium","Females","15 to 29 years",2020,0.105]
[null,"Belgium","Females","15 to 29 years",2021,0.10300000000000001]
[null,"Belgium","Females","15 to 29 years",2022,9.9000000000000005E-2]
[null,"Belgium","Females","15 to 29 years",2023,0.10099999999999999]
[null,"Belgium","Females","15 to 29 years",2024,0.1]
[null,"Bulgaria","Females","15 to 29 years",2010,0.16399999999999998]
[null,"Bulgaria","Females","15 to 29 years",2011,0.19800000000000001]
[null,"Bulgaria","Females","15 to 29 years",2012,0.20800000000000002]
[null,"Bulgaria","Females","15 to 29 years",2013,0.22600000000000001]
[null,"Bulgaria","Females","15 to 29 years",2014,0.188]
[null,"Bulgaria","Females","15 to 29 years",2015,0.153]
[null,"Bulgaria","Females","15 to 29 years",2016,0.122]
[null,"Bulgaria","Females","15 to 29 years",2017,0.11]
[null,"Bulgaria","Females","15 to 29 years",2018,8.5000000000000006E-2]
[null,"Bulgaria","Females","15 to 29 years",2019,7.6999999999999999E-2]
[null,"Bulgaria","Females","15 to 29 years",2020,0.1]
[null,"Bulgaria","Females","15 to 29 years",2021,9.5000000000000001E-2]
[null,"Bulgaria","Females","15 to 29 years",2022,6.9000000000000006E-2]
[null,"Bulgaria","Females","15 to 29 years",2023,7.2999999999999995E-2]
[null,"Bulgaria","Females","15 to 29 years",2024,7.0999999999999994E-2]
[null,"Croatia","Females","15 to 29 years",2010,0.23199999999999998]
[null,"Croatia","Females","15 to 29 years",2011,0.28399999999999997]
[null,"Croatia","Females","15 to 29 years",2012,0.308]
[null,"Croatia","Females","15 to 29 years",2013,0.32400000000000001]
[null,"Croatia","Females","15 to 29 years",2014,0.32600000000000001]
[null,"Croatia","Females","15 to 29 years",2015,0.313]
[null,"Croatia","Females","15 to 29 years",2016,0.252]
[null,"Croatia","Females","15 to 29 years",2017,0.22500000000000001]
[null,"Croatia","Females","15 to 29 years",2018,0.21199999999999999]
[null,"Croatia","Females","15 to 29 years",2019,0.16399999999999998]
[null,"Croatia","Females","15 to 29 years",2020,0.19]
[null,"Croatia","Females","15 to 29 years",2021,0.18899999999999997]
[null,"Croatia","Females","15 to 29 years",2022,0.185]
[null,"Croatia","Females","15 to 29 years",2023,0.15]
[null,"Croatia","Females","15 to 29 years",2024,0.11]
[null,"Cyprus","Females","15 to 29 years",2010,0.114]
[null,"Cyprus","Females","15 to 29 years",2011,0.13699999999999998]
[null,"Cyprus","Females","15 to 29 years",2012,0.19500000000000001]
[null,"Cyprus","Females","15 to 29 years",2013,0.25700000000000001]
[null,"Cyprus","Females","15 to 29 years",2014,0.24600000000000002]
[null,"Cyprus","Females","15 to 29 years",2015,0.24399999999999999]
[null,"Cyprus","Females","15 to 29 years",2016,0.22800000000000001]
[null,"Cyprus","Females","15 to 29 years",2017,0.187]
[null,"Cyprus","Females","15 to 29 years",2018,0.13300000000000001]
[null,"Cyprus","Females","15 to 29 years",2019,0.122]
[null,"Cyprus","Females","15 to 29 years",2020,0.10800000000000001]
[null,"Cyprus","Females","15 to 29 years",2021,0.12300000000000001]
[null,"Cyprus","Females","15 to 29 years",2022,0.13900000000000001]
[null,"Cyprus","Females","15 to 29 years",2023,0.10400000000000001]
[null,"Cyprus","Females","15 to 29 years",2024,8.199999999999999E-2]
[null,"Czechia","Females","15 to 29 years",2010,0.13500000000000001]
[null,"Czechia","Females","15 to 29 years",2011,0.126]
[null,"Czechia","Females","15 to 29 years",2012,0.13500000000000001]
[null,"Czechia","Females","15 to 29 years",2013,0.126]
[null,"Czechia","Females","15 to 29 years",2014,0.11699999999999999]
[null,"Czechia","Females","15 to 29 years",2015,0.10099999999999999]
[null,"Czechia","Females","15 to 29 years",2016,8.900000000000001E-2]
[null,"Czechia","Females","15 to 29 years",2017,5.9000000000000004E-2]
[null,"Czechia","Females","15 to 29 years",2018,5.0999999999999997E-2]
[null,"Czechia","Females","15 to 29 years",2019,4.0999999999999995E-2]
[null,"Czechia","Females","15 to 29 years",2020,6.3E-2]
[null,"Czechia","Females","15 to 29 years",2021,6.4000000000000001E-2]
[null,"Czechia","Females","15 to 29 years",2022,5.2999999999999999E-2]
[null,"Czechia","Females","15 to 29 years",2023,6.2E-2]
[null,"Czechia","Females","15 to 29 years",2024,6.6000000000000003E-2]
[null,"Denmark","Females","15 to 29 years",2010,0.121]
[null,"Denmark","Females","15 to 29 years",2011,0.13699999999999998]
[null,"Denmark","Females","15 to 29 years",2012,0.13400000000000001]
[null,"Denmark","Females","15 to 29 years",2013,0.128]
[null,"Denmark","Females","15 to 29 years",2014,0.11900000000000001]
[null,"Denmark","Females","15 to 29 years",2015,0.107]
[null,"Denmark","Females","15 to 29 years",2016,0.109]
[null,"Denmark","Females","15 to 29 years",2017,0.11199999999999999]
[null,"Denmark","Females","15 to 29 years",2018,9.3000000000000013E-2]
[null,"Denmark","Females","15 to 29 years",2019,9.6999999999999989E-2]
[null,"Denmark","Females","15 to 29 years",2020,0.10800000000000001]
[null,"Denmark","Females","15 to 29 years",2021,9.5000000000000001E-2]
[null,"Denmark","Females","15 to 29 years",2022,8.5999999999999993E-2]
[null,"Denmark","Females","15 to 29 years",2023,0.10400000000000001]
[null,"Denmark","Females","15 to 29 years",2024,0.12300000000000001]
[null,"Estonia","Females","15 to 29 years",2010,0.223]
[null,"Estonia","Females","15 to 29 years",2011,0.16899999999999998]
[null,"Estonia","Females","15 to 29 years",2012,0.14699999999999999]
[null,"Estonia","Females","15 to 29 years",2013,0.14099999999999999]
[null,"Estonia","Females","15 to 29 years",2014,9.6999999999999989E-2]
[null,"Estonia","Females","15 to 29 years",2015,9.5000000000000001E-2]
[null,"Estonia","Females","15 to 29 years",2016,8.5999999999999993E-2]
[null,"Estonia","Females","15 to 29 years",2017,7.5999999999999998E-2]
[null,"Estonia","Females","15 to 29 years",2018,7.4999999999999997E-2]
[null,"Estonia","Females","15 to 29 years",2019,9.0999999999999998E-2]
[null,"Estonia","Females","15 to 29 years",2020,0.13900000000000001]
[null,"Estonia","Females","15 to 29 years",2021,0.10300000000000001]
[null,"Estonia","Females","15 to 29 years",2022,0.1]
[null,"Estonia","Females","15 to 29 years",2023,0.12]
[null,"Estonia","Females","15 to 29 years",2024,0.14400000000000002]
[null,"Finland","Females","15 to 29 years",2010,0.14300000000000002]
[null,"Finland","Females","15 to 29 years",2011,0.14000000000000001]
[null,"Finland","Females","15 to 29 years",2012,0.13699999999999998]
[null,"Finland","Females","15 to 29 years",2013,0.13699999999999998]
[null,"Finland","Females","15 to 29 years",2014,0.14300000000000002]
[null,"Finland","Females","15 to 29 years",2015,0.158]
[null,"Finland","Females","15 to 29 years",2016,0.14499999999999999]
[null,"Finland","Females","15 to 29 years",2017,0.14599999999999999]
[null,"Finland","Females","15 to 29 years",2018,0.127]
[null,"Finland","Females","15 to 29 years",2019,0.115]
[null,"Finland","Females","15 to 29 years",2020,0.14300000000000002]
[null,"Finland","Females","15 to 29 years",2021,0.12300000000000001]
[null,"Finland","Females","15 to 29 years",2022,0.111]
[null,"Finland","Females","15 to 29 years",2023,0.121]
[null,"Finland","Females","15 to 29 years",2024,0.14199999999999999]
[null,"France","Females","15 to 29 years",2010,0.17300000000000001]
[null,"France","Females","15 to 29 years",2011,0.17800000000000002]
[null,"France","Females","15 to 29 years",2012,0.17800000000000002]
[null,"France","Females","15 to 29 years",2013,0.19]
[null,"France","Females","15 to 29 years",2014,0.17899999999999999]
[null,"France","Females","15 to 29 years",2015,0.18]
[null,"France","Females","15 to 29 years",2016,0.18]
[null,"France","Females","15 to 29 years",2017,0.16300000000000001]
[null,"France","Females","15 to 29 years",2018,0.158]
[null,"France","Females","15 to 29 years",2019,0.14199999999999999]
[null,"France","Females","15 to 29 years",2020,0.152]
[null,"France","Females","15 to 29 years",2021,0.14300000000000002]
[null,"France","Females","15 to 29 years",2022,0.127]
[null,"France","Females","15 to 29 years",2023,0.13200000000000001]
[null,"France","Females","15 to 29 years",2024,0.14000000000000001]
[null,"Germany","Females","15 to 29 years",2010,7.4999999999999997E-2]
[null,"Germany","Females","15 to 29 years",2011,6.6000000000000003E-2]
[null,"Germany","Females","15 to 29 years",2012,7.0999999999999994E-2]
[null,"Germany","Females","15 to 29 years",2013,7.0000000000000007E-2]
[null,"Germany","Females","15 to 29 years",2014,6.6000000000000003E-2]
[null,"Germany","Females","15 to 29 years",2015,6.0999999999999999E-2]
[null,"Germany","Females","15 to 29 years",2016,5.7000000000000002E-2]
[null,"Germany","Females","15 to 29 years",2017,5.2999999999999999E-2]
[null,"Germany","Females","15 to 29 years",2018,4.7E-2]
[null,"Germany","Females","15 to 29 years",2019,4.4000000000000004E-2]
[null,"Germany","Females","15 to 29 years",2020,5.9000000000000004E-2]
[null,"Germany","Females","15 to 29 years",2021,5.4000000000000006E-2]
[null,"Germany","Females","15 to 29 years",2022,4.4999999999999998E-2]
[null,"Germany","Females","15 to 29 years",2023,4.5999999999999999E-2]
[null,"Germany","Females","15 to 29 years",2024,0.05]
[null,"Greece","Females","15 to 29 years",2010,0.3]
[null,"Greece","Females","15 to 29 years",2011,0.40200000000000002]
[null,"Greece","Females","15 to 29 years",2012,0.48499999999999999]
[null,"Greece","Females","15 to 29 years",2013,0.52800000000000002]
[null,"Greece","Females","15 to 29 years",2014,0.48700000000000004]
[null,"Greece","Females","15 to 29 years",2015,0.45799999999999996]
[null,"Greece","Females","15 to 29 years",2016,0.44400000000000001]
[null,"Greece","Females","15 to 29 years",2017,0.42100000000000004]
[null,"Greece","Females","15 to 29 years",2018,0.38]
[null,"Greece","Females","15 to 29 years",2019,0.33200000000000002]
[null,"Greece","Females","15 to 29 years",2020,0.34600000000000003]
[null,"Greece","Females","15 to 29 years",2021,0.32899999999999996]
[null,"Greece","Females","15 to 29 years",2022,0.29199999999999998]
[null,"Greece","Females","15 to 29 years",2023,0.249]
[null,"Greece","Females","15 to 29 years",2024,0.19500000000000001]
[null,"Hungary","Females","15 to 29 years",2010,0.16399999999999998]
[null,"Hungary","Females","15 to 29 years",2011,0.161]
[null,"Hungary","Females","15 to 29 years",2012,0.17300000000000001]
[null,"Hungary","Females","15 to 29 years",2013,0.16600000000000001]
[null,"Hungary","Females","15 to 29 years",2014,0.13900000000000001]
[null,"Hungary","Females","15 to 29 years",2015,0.113]
[null,"Hungary","Females","15 to 29 years",2016,8.6999999999999994E-2]
[null,"Hungary","Females","15 to 29 years",2017,0.08]
[null,"Hungary","Females","15 to 29 years",2018,6.8000000000000005E-2]
[null,"Hungary","Females","15 to 29 years",2019,6.6000000000000003E-2]
[null,"Hungary","Females","15 to 29 years",2020,8.6999999999999994E-2]
[null,"Hungary","Females","15 to 29 years",2021,8.5000000000000006E-2]
[null,"Hungary","Females","15 to 29 years",2022,6.2E-2]
[null,"Hungary","Females","15 to 29 years",2023,7.8E-2]
[null,"Hungary","Females","15 to 29 years",2024,8.5000000000000006E-2]
[null,"Ireland","Females","15 to 29 years",2010,0.16899999999999998]
[null,"Ireland","Females","15 to 29 years",2011,0.188]
[null,"Ireland","Females","15 to 29 years",2012,0.188]
[null,"Ireland","Females","15 to 29 years",2013,0.18]
[null,"Ireland","Females","15 to 29 years",2014,0.16800000000000001]
[null,"Ireland","Females","15 to 29 years",2015,0.13500000000000001]
[null,"Ireland","Females","15 to 29 years",2016,0.115]
[null,"Ireland","Females","15 to 29 years",2017,0.10199999999999999]
[null,"Ireland","Females","15 to 29 years",2018,9.6999999999999989E-2]
[null,"Ireland","Females","15 to 29 years",2019,8.1000000000000003E-2]
[null,"Ireland","Females","15 to 29 years",2020,0.11699999999999999]
[null,"Ireland","Females","15 to 29 years",2021,0.105]
[null,"Ireland","Females","15 to 29 years",2022,0.08]
[null,"Ireland","Females","15 to 29 years",2023,7.8E-2]
[null,"Ireland","Females","15 to 29 years",2024,8.3000000000000004E-2]
[null,"Italy","Females","15 to 29 years",2010,0.21899999999999997]
[null,"Italy","Females","15 to 29 years",2011,0.22899999999999998]
[null,"Italy","Females","15 to 29 years",2012,0.27200000000000002]
[null,"Italy","Females","15 to 29 years",2013,0.316]
[null,"Italy","Females","15 to 29 years",2014,0.33399999999999996]
[null,"Italy","Females","15 to 29 years",2015,0.314]
[null,"Italy","Females","15 to 29 years",2016,0.30599999999999999]
[null,"Italy","Females","15 to 29 years",2017,0.28600000000000003]
[null,"Italy","Females","15 to 29 years",2018,0.26600000000000001]
[null,"Italy","Females","15 to 29 years",2019,0.23800000000000002]
[null,"Italy","Females","15 to 29 years",2020,0.24]
[null,"Italy","Females","15 to 29 years",2021,0.23499999999999999]
[null,"Italy","Females","15 to 29 years",2022,0.19600000000000001]
[null,"Italy","Females","15 to 29 years",2023,0.183]
[null,"Italy","Females","15 to 29 years",2024,0.158]
[null,"Latvia","Females","15 to 29 years",2010,0.26500000000000001]
[null,"Latvia","Females","15 to 29 years",2011,0.22500000000000001]
[null,"Latvia","Females","15 to 29 years",2012,0.215]
[null,"Latvia","Females","15 to 29 years",2013,0.16300000000000001]
[null,"Latvia","Females","15 to 29 years",2014,0.14899999999999999]
[null,"Latvia","Females","15 to 29 years",2015,0.11599999999999999]
[null,"Latvia","Females","15 to 29 years",2016,0.11699999999999999]
[null,"Latvia","Females","15 to 29 years",2017,0.114]
[null,"Latvia","Females","15 to 29 years",2018,9.9000000000000005E-2]
[null,"Latvia","Females","15 to 29 years",2019,8.199999999999999E-2]
[null,"Latvia","Females","15 to 29 years",2020,0.128]
[null,"Latvia","Females","15 to 29 years",2021,9.5000000000000001E-2]
[null,"Latvia","Females","15 to 29 years",2022,8.3000000000000004E-2]
[null,"Latvia","Females","15 to 29 years",2023,7.6999999999999999E-2]
[null,"Latvia","Females","15 to 29 years",2024,0.11699999999999999]
[null,"Lithuania","Females","15 to 29 years",2010,0.22]
[null,"Lithuania","Females","15 to 29 years",2011,0.19500000000000001]
[null,"Lithuania","Females","15 to 29 years",2012,0.16899999999999998]
[null,"Lithuania","Females","15 to 29 years",2013,0.16200000000000001]
[null,"Lithuania","Females","15 to 29 years",2014,0.13600000000000001]
[null,"Lithuania","Females","15 to 29 years",2015,0.13100000000000001]
[null,"Lithuania","Females","15 to 29 years",2016,0.09]
[null,"Lithuania","Females","15 to 29 years",2017,7.0999999999999994E-2]
[null,"Lithuania","Females","15 to 29 years",2018,6.2E-2]
[null,"Lithuania","Females","15 to 29 years",2019,6.8000000000000005E-2]
[null,"Lithuania","Females","15 to 29 years",2020,0.11199999999999999]
[null,"Lithuania","Females","15 to 29 years",2021,0.10300000000000001]
[null,"Lithuania","Females","15 to 29 years",2022,0.08]
[null,"Lithuania","Females","15 to 29 years",2023,8.4000000000000005E-2]
[null,"Lithuania","Females","15 to 29 years",2024,0.12]
[null,"Luxembourg","Females","15 to 29 years",2010,7.6999999999999999E-2]
[null,"Luxembourg","Females","15 to 29 years",2011,0.11199999999999999]
[null,"Luxembourg","Females","15 to 29 years",2012,0.11900000000000001]
[null,"Luxembourg","Females","15 to 29 years",2013,9.5000000000000001E-2]
[null,"Luxembourg","Females","15 to 29 years",2014,0.10300000000000001]
[null,"Luxembourg","Females","15 to 29 years",2015,0.12300000000000001]
[null,"Luxembourg","Females","15 to 29 years",2016,0.109]
[null,"Luxembourg","Females","15 to 29 years",2017,7.8E-2]
[null,"Luxembourg","Females","15 to 29 years",2018,0.10199999999999999]
[null,"Luxembourg","Females","15 to 29 years",2019,9.5000000000000001E-2]
[null,"Luxembourg","Females","15 to 29 years",2020,0.11599999999999999]
[null,"Luxembourg","Females","15 to 29 years",2021,0.10199999999999999]
[null,"Luxembourg","Females","15 to 29 years",2022,9.8000000000000004E-2]
[null,"Luxembourg","Females","15 to 29 years",2023,0.11199999999999999]
[null,"Luxembourg","Females","15 to 29 years",2024,0.11199999999999999]
[null,"Malta","Females","15 to 29 years",2010,8.1000000000000003E-2]
[null,"Malta","Females","15 to 29 years",2011,8.8000000000000009E-2]
[null,"Malta","Females","15 to 29 years",2012,0.10300000000000001]
[null,"Malta","Females","15 to 29 years",2013,7.400000000000001E-2]
[null,"Malta","Females","15 to 29 years",2014,6.9000000000000006E-2]
[null,"Malta","Females","15 to 29 years",2015,0.08]
[null,"Malta","Females","15 to 29 years",2016,7.0000000000000007E-2]
[null,"Malta","Females","15 to 29 years",2017,6.5000000000000002E-2]
[null,"Malta","Females","15 to 29 years",2018,4.2000000000000003E-2]
[null,"Malta","Females","15 to 29 years",2019,6.0999999999999999E-2]
[null,"Malta","Females","15 to 29 years",2020,7.0000000000000007E-2]
[null,"Malta","Females","15 to 29 years",2021,5.0999999999999997E-2]
[null,"Malta","Females","15 to 29 years",2022,5.4000000000000006E-2]
[null,"Malta","Females","15 to 29 years",2023,0.05]
[null,"Malta","Females","15 to 29 years",2024,5.2000000000000005E-2]
[null,"Netherlands","Females","15 to 29 years",2010,9.9000000000000005E-2]
[null,"Netherlands","Females","15 to 29 years",2011,9.1999999999999998E-2]
[null,"Netherlands","Females","15 to 29 years",2012,0.11]
[null,"Netherlands","Females","15 to 29 years",2013,0.12]
[null,"Netherlands","Females","15 to 29 years",2014,0.12]
[null,"Netherlands","Females","15 to 29 years",2015,0.106]
[null,"Netherlands","Females","15 to 29 years",2016,9.6999999999999989E-2]
[null,"Netherlands","Females","15 to 29 years",2017,8.6999999999999994E-2]
[null,"Netherlands","Females","15 to 29 years",2018,6.7000000000000004E-2]
[null,"Netherlands","Females","15 to 29 years",2019,6.5000000000000002E-2]
[null,"Netherlands","Females","15 to 29 years",2020,8.6999999999999994E-2]
[null,"Netherlands","Females","15 to 29 years",2021,7.2000000000000008E-2]
[null,"Netherlands","Females","15 to 29 years",2022,6.3E-2]
[null,"Netherlands","Females","15 to 29 years",2023,6.6000000000000003E-2]
[null,"Netherlands","Females","15 to 29 years",2024,7.0000000000000007E-2]
[null,"Poland","Females","15 to 29 years",2010,0.18100000000000002]
[null,"Poland","Females","15 to 29 years",2011,0.19800000000000001]
[null,"Poland","Females","15 to 29 years",2012,0.21199999999999999]
[null,"Poland","Females","15 to 29 years",2013,0.21299999999999999]
[null,"Poland","Females","15 to 29 years",2014,0.17800000000000002]
[null,"Poland","Females","15 to 29 years",2015,0.14000000000000001]
[null,"Poland","Females","15 to 29 years",2016,0.12]
[null,"Poland","Females","15 to 29 years",2017,9.6000000000000002E-2]
[null,"Poland","Females","15 to 29 years",2018,8.1000000000000003E-2]
[null,"Poland","Females","15 to 29 years",2019,7.0000000000000007E-2]
[null,"Poland","Females","15 to 29 years",2020,7.2999999999999995E-2]
[null,"Poland","Females","15 to 29 years",2021,7.2999999999999995E-2]
[null,"Poland","Females","15 to 29 years",2022,6.9000000000000006E-2]
[null,"Poland","Females","15 to 29 years",2023,7.400000000000001E-2]
[null,"Poland","Females","15 to 29 years",2024,7.2000000000000008E-2]
[null,"Portugal","Females","15 to 29 years",2010,0.20100000000000001]
[null,"Portugal","Females","15 to 29 years",2011,0.23800000000000002]
[null,"Portugal","Females","15 to 29 years",2012,0.29399999999999998]
[null,"Portugal","Females","15 to 29 years",2013,0.30599999999999999]
[null,"Portugal","Females","15 to 29 years",2014,0.26600000000000001]
[null,"Portugal","Females","15 to 29 years",2015,0.23699999999999999]
[null,"Portugal","Females","15 to 29 years",2016,0.214]
[null,"Portugal","Females","15 to 29 years",2017,0.17600000000000002]
[null,"Portugal","Females","15 to 29 years",2018,0.14099999999999999]
[null,"Portugal","Females","15 to 29 years",2019,0.13800000000000001]
[null,"Portugal","Females","15 to 29 years",2020,0.158]
[null,"Portugal","Females","15 to 29 years",2021,0.17399999999999999]
[null,"Portugal","Females","15 to 29 years",2022,0.13800000000000001]
[null,"Portugal","Females","15 to 29 years",2023,0.14099999999999999]
[null,"Portugal","Females","15 to 29 years",2024,0.14300000000000002]
[null,"Romania","Females","15 to 29 years",2010,0.18]
[null,"Romania","Females","15 to 29 years",2011,0.185]
[null,"Romania","Females","15 to 29 years",2012,0.17899999999999999]
[null,"Romania","Females","15 to 29 years",2013,0.187]
[null,"Romania","Females","15 to 29 years",2014,0.184]
[null,"Romania","Females","15 to 29 years",2015,0.16699999999999998]
[null,"Romania","Females","15 to 29 years",2016,0.15]
[null,"Romania","Females","15 to 29 years",2017,0.126]
[null,"Romania","Females","15 to 29 years",2018,0.11199999999999999]
[null,"Romania","Females","15 to 29 years",2019,0.115]
[null,"Romania","Females","15 to 29 years",2020,0.13]
[null,"Romania","Females","15 to 29 years",2021,0.124]
[null,"Romania","Females","15 to 29 years",2022,0.13699999999999998]
[null,"Romania","Females","15 to 29 years",2023,0.124]
[null,"Romania","Females","15 to 29 years",2024,0.13400000000000001]
[null,"Slovakia","Females","15 to 29 years",2010,0.214]
[null,"Slovakia","Females","15 to 29 years",2011,0.22699999999999998]
[null,"Slovakia","Females","15 to 29 years",2012,0.251]
[null,"Slovakia","Females","15 to 29 years",2013,0.23199999999999998]
[null,"Slovakia","Females","15 to 29 years",2014,0.20499999999999999]
[null,"Slovakia","Females","15 to 29 years",2015,0.187]
[null,"Slovakia","Females","15 to 29 years",2016,0.18]
[null,"Slovakia","Females","15 to 29 years",2017,0.14699999999999999]
[null,"Slovakia","Females","15 to 29 years",2018,0.114]
[null,"Slovakia","Females","15 to 29 years",2019,9.8000000000000004E-2]
[null,"Slovakia","Females","15 to 29 years",2020,0.13800000000000001]
[null,"Slovakia","Females","15 to 29 years",2021,0.14199999999999999]
[null,"Slovakia","Females","15 to 29 years",2022,0.115]
[null,"Slovakia","Females","15 to 29 years",2023,0.10300000000000001]
[null,"Slovakia","Females","15 to 29 years",2024,0.107]
[null,"Slovenia","Females","15 to 29 years",2010,0.13500000000000001]
[null,"Slovenia","Females","15 to 29 years",2011,0.159]
[null,"Slovenia","Females","15 to 29 years",2012,0.19]
[null,"Slovenia","Females","15 to 29 years",2013,0.21299999999999999]
[null,"Slovenia","Females","15 to 29 years",2014,0.223]
[null,"Slovenia","Females","15 to 29 years",2015,0.17899999999999999]
[null,"Slovenia","Females","15 to 29 years",2016,0.161]
[null,"Slovenia","Females","15 to 29 years",2017,0.13600000000000001]
[null,"Slovenia","Females","15 to 29 years",2018,9.9000000000000005E-2]
[null,"Slovenia","Females","15 to 29 years",2019,0.09]
[null,"Slovenia","Females","15 to 29 years",2020,0.11]
[null,"Slovenia","Females","15 to 29 years",2021,0.114]
[null,"Slovenia","Females","15 to 29 years",2022,9.8000000000000004E-2]
[null,"Slovenia","Females","15 to 29 years",2023,7.0999999999999994E-2]
[null,"Slovenia","Females","15 to 29 years",2024,9.1999999999999998E-2]
[null,"Spain","Females","15 to 29 years",2010,0.3]
[null,"Spain","Females","15 to 29 years",2011,0.33]
[null,"Spain","Females","15 to 29 years",2012,0.38299999999999995]
[null,"Spain","Females","15 to 29 years",2013,0.41100000000000003]
[null,"Spain","Females","15 to 29 years",2014,0.39100000000000001]
[null,"Spain","Females","15 to 29 years",2015,0.36099999999999999]
[null,"Spain","Females","15 to 29 years",2016,0.33799999999999997]
[null,"Spain","Females","15 to 29 years",2017,0.29399999999999998]
[null,"Spain","Females","15 to 29 years",2018,0.26200000000000001]
[null,"Spain","Females","15 to 29 years",2019,0.254]
[null,"Spain","Females","15 to 29 years",2020,0.29899999999999999]
[null,"Spain","Females","15 to 29 years",2021,0.27600000000000002]
[null,"Spain","Females","15 to 29 years",2022,0.23199999999999998]
[null,"Spain","Females","15 to 29 years",2023,0.215]
[null,"Spain","Females","15 to 29 years",2024,0.20499999999999999]
[null,"Sweden","Females","15 to 29 years",2010,0.182]
[null,"Sweden","Females","15 to 29 years",2011,0.16800000000000001]
[null,"Sweden","Females","15 to 29 years",2012,0.16800000000000001]
[null,"Sweden","Females","15 to 29 years",2013,0.16899999999999998]
[null,"Sweden","Females","15 to 29 years",2014,0.159]
[null,"Sweden","Females","15 to 29 years",2015,0.14800000000000002]
[null,"Sweden","Females","15 to 29 years",2016,0.128]
[null,"Sweden","Females","15 to 29 years",2017,0.125]
[null,"Sweden","Females","15 to 29 years",2018,0.121]
[null,"Sweden","Females","15 to 29 years",2019,0.14199999999999999]
[null,"Sweden","Females","15 to 29 years",2020,0.16399999999999998]
[null,"Sweden","Females","15 to 29 years",2021,0.17300000000000001]
[null,"Sweden","Females","15 to 29 years",2022,0.16500000000000001]
[null,"Sweden","Females","15 to 29 years",2023,0.161]
[null,"Sweden","Females","15 to 29 years",2024,0.17]
[null,"Austria","Females","15 to 74 years",2010,4.9000000000000002E-2]
[null,"Austria","Females","15 to 74 years",2011,4.8000000000000001E-2]
[null,"Austria","Females","15 to 74 years",2012,0.05]
[null,"Austria","Females","15 to 74 years",2013,5.5E-2]
[null,"Austria","Females","15 to 74 years",2014,5.5999999999999994E-2]
[null,"Austria","Females","15 to 74 years",2015,5.5999999999999994E-2]
[null,"Austria","Females","15 to 74 years",2016,5.7999999999999996E-2]
[null,"Austria","Females","15 to 74 years",2017,5.2999999999999999E-2]
[null,"Austria","Females","15 to 74 years",2018,4.9000000000000002E-2]
[null,"Austria","Females","15 to 74 years",2019,4.5999999999999999E-2]
[null,"Austria","Females","15 to 74 years",2020,5.9000000000000004E-2]
[null,"Austria","Females","15 to 74 years",2021,6.0999999999999999E-2]
[null,"Austria","Females","15 to 74 years",2022,4.4999999999999998E-2]
[null,"Austria","Females","15 to 74 years",2023,4.9000000000000002E-2]
[null,"Austria","Females","15 to 74 years",2024,4.7E-2]
[null,"Belgium","Females","15 to 74 years",2010,8.5999999999999993E-2]
[null,"Belgium","Females","15 to 74 years",2011,7.2999999999999995E-2]
[null,"Belgium","Females","15 to 74 years",2012,7.4999999999999997E-2]
[null,"Belgium","Females","15 to 74 years",2013,8.3000000000000004E-2]
[null,"Belgium","Females","15 to 74 years",2014,8.1000000000000003E-2]
[null,"Belgium","Females","15 to 74 years",2015,7.9000000000000001E-2]
[null,"Belgium","Females","15 to 74 years",2016,7.5999999999999998E-2]
[null,"Belgium","Females","15 to 74 years",2017,7.0999999999999994E-2]
[null,"Belgium","Females","15 to 74 years",2018,5.5999999999999994E-2]
[null,"Belgium","Females","15 to 74 years",2019,0.05]
[null,"Belgium","Females","15 to 74 years",2020,5.5E-2]
[null,"Belgium","Females","15 to 74 years",2021,5.9000000000000004E-2]
[null,"Belgium","Females","15 to 74 years",2022,5.2999999999999999E-2]
[null,"Belgium","Females","15 to 74 years",2023,5.0999999999999997E-2]
[null,"Belgium","Females","15 to 74 years",2024,5.2999999999999999E-2]
[null,"Bulgaria","Females","15 to 74 years",2010,0.106]
[null,"Bulgaria","Females","15 to 74 years",2011,0.111]
[null,"Bulgaria","Females","15 to 74 years",2012,0.11800000000000001]
[null,"Bulgaria","Females","15 to 74 years",2013,0.128]
[null,"Bulgaria","Females","15 to 74 years",2014,0.113]
[null,"Bulgaria","Females","15 to 74 years",2015,9.3000000000000013E-2]
[null,"Bulgaria","Females","15 to 74 years",2016,7.9000000000000001E-2]
[null,"Bulgaria","Females","15 to 74 years",2017,6.9000000000000006E-2]
[null,"Bulgaria","Females","15 to 74 years",2018,5.5999999999999994E-2]
[null,"Bulgaria","Females","15 to 74 years",2019,4.8000000000000001E-2]
[null,"Bulgaria","Females","15 to 74 years",2020,5.5999999999999994E-2]
[null,"Bulgaria","Females","15 to 74 years",2021,4.9000000000000002E-2]
[null,"Bulgaria","Females","15 to 74 years",2022,3.9E-2]
[null,"Bulgaria","Females","15 to 74 years",2023,4.2000000000000003E-2]
[null,"Bulgaria","Females","15 to 74 years",2024,3.9E-2]
[null,"Croatia","Females","15 to 74 years",2010,0.124]
[null,"Croatia","Females","15 to 74 years",2011,0.13800000000000001]
[null,"Croatia","Females","15 to 74 years",2012,0.16]
[null,"Croatia","Females","15 to 74 years",2013,0.16800000000000001]
[null,"Croatia","Females","15 to 74 years",2014,0.183]
[null,"Croatia","Females","15 to 74 years",2015,0.17]
[null,"Croatia","Females","15 to 74 years",2016,0.13699999999999998]
[null,"Croatia","Females","15 to 74 years",2017,0.11800000000000001]
[null,"Croatia","Females","15 to 74 years",2018,9.3000000000000013E-2]
[null,"Croatia","Females","15 to 74 years",2019,7.0999999999999994E-2]
[null,"Croatia","Females","15 to 74 years",2020,7.4999999999999997E-2]
[null,"Croatia","Females","15 to 74 years",2021,0.08]
[null,"Croatia","Females","15 to 74 years",2022,7.9000000000000001E-2]
[null,"Croatia","Females","15 to 74 years",2023,6.7000000000000004E-2]
[null,"Croatia","Females","15 to 74 years",2024,0.05]
[null,"Cyprus","Females","15 to 74 years",2010,6.4000000000000001E-2]
[null,"Cyprus","Females","15 to 74 years",2011,7.6999999999999999E-2]
[null,"Cyprus","Females","15 to 74 years",2012,0.111]
[null,"Cyprus","Females","15 to 74 years",2013,0.152]
[null,"Cyprus","Females","15 to 74 years",2014,0.151]
[null,"Cyprus","Females","15 to 74 years",2015,0.14800000000000002]
[null,"Cyprus","Females","15 to 74 years",2016,0.13400000000000001]
[null,"Cyprus","Females","15 to 74 years",2017,0.113]
[null,"Cyprus","Females","15 to 74 years",2018,8.8000000000000009E-2]
[null,"Cyprus","Females","15 to 74 years",2019,7.6999999999999999E-2]
[null,"Cyprus","Females","15 to 74 years",2020,7.4999999999999997E-2]
[null,"Cyprus","Females","15 to 74 years",2021,7.2999999999999995E-2]
[null,"Cyprus","Females","15 to 74 years",2022,6.8000000000000005E-2]
[null,"Cyprus","Females","15 to 74 years",2023,5.9000000000000004E-2]
[null,"Cyprus","Females","15 to 74 years",2024,5.0999999999999997E-2]
[null,"Czechia","Females","15 to 74 years",2010,8.5000000000000006E-2]
[null,"Czechia","Females","15 to 74 years",2011,7.9000000000000001E-2]
[null,"Czechia","Females","15 to 74 years",2012,8.199999999999999E-2]
[null,"Czechia","Females","15 to 74 years",2013,8.3000000000000004E-2]
[null,"Czechia","Females","15 to 74 years",2014,7.400000000000001E-2]
[null,"Czechia","Females","15 to 74 years",2015,6.0999999999999999E-2]
[null,"Czechia","Females","15 to 74 years",2016,4.7E-2]
[null,"Czechia","Females","15 to 74 years",2017,3.6000000000000004E-2]
[null,"Czechia","Females","15 to 74 years",2018,2.7999999999999997E-2]
[null,"Czechia","Females","15 to 74 years",2019,2.4E-2]
[null,"Czechia","Females","15 to 74 years",2020,0.03]
[null,"Czechia","Females","15 to 74 years",2021,3.4000000000000002E-2]
[null,"Czechia","Females","15 to 74 years",2022,2.7999999999999997E-2]
[null,"Czechia","Females","15 to 74 years",2023,3.1E-2]
[null,"Czechia","Females","15 to 74 years",2024,0.03]
[null,"Denmark","Females","15 to 74 years",2010,6.8000000000000005E-2]
[null,"Denmark","Females","15 to 74 years",2011,7.5999999999999998E-2]
[null,"Denmark","Females","15 to 74 years",2012,7.8E-2]
[null,"Denmark","Females","15 to 74 years",2013,7.6999999999999999E-2]
[null,"Denmark","Females","15 to 74 years",2014,7.0999999999999994E-2]
[null,"Denmark","Females","15 to 74 years",2015,6.5000000000000002E-2]
[null,"Denmark","Females","15 to 74 years",2016,6.4000000000000001E-2]
[null,"Denmark","Females","15 to 74 years",2017,6.0999999999999999E-2]
[null,"Denmark","Females","15 to 74 years",2018,5.2999999999999999E-2]
[null,"Denmark","Females","15 to 74 years",2019,5.2999999999999999E-2]
[null,"Denmark","Females","15 to 74 years",2020,0.06]
[null,"Denmark","Females","15 to 74 years",2021,5.2000000000000005E-2]
[null,"Denmark","Females","15 to 74 years",2022,4.4999999999999998E-2]
[null,"Denmark","Females","15 to 74 years",2023,5.2999999999999999E-2]
[null,"Denmark","Females","15 to 74 years",2024,6.5000000000000002E-2]
[null,"Estonia","Females","15 to 74 years",2010,0.13900000000000001]
[null,"Estonia","Females","15 to 74 years",2011,0.115]
[null,"Estonia","Females","15 to 74 years",2012,8.900000000000001E-2]
[null,"Estonia","Females","15 to 74 years",2013,0.08]
[null,"Estonia","Females","15 to 74 years",2014,6.7000000000000004E-2]
[null,"Estonia","Females","15 to 74 years",2015,6.2E-2]
[null,"Estonia","Females","15 to 74 years",2016,6.0999999999999999E-2]
[null,"Estonia","Females","15 to 74 years",2017,5.0999999999999997E-2]
[null,"Estonia","Females","15 to 74 years",2018,5.2000000000000005E-2]
[null,"Estonia","Females","15 to 74 years",2019,4.8000000000000001E-2]
[null,"Estonia","Females","15 to 74 years",2020,6.6000000000000003E-2]
[null,"Estonia","Females","15 to 74 years",2021,5.5999999999999994E-2]
[null,"Estonia","Females","15 to 74 years",2022,5.0999999999999997E-2]
[null,"Estonia","Females","15 to 74 years",2023,6.7000000000000004E-2]
[null,"Estonia","Females","15 to 74 years",2024,7.4999999999999997E-2]
[null,"Finland","Females","15 to 74 years",2010,7.6999999999999999E-2]
[null,"Finland","Females","15 to 74 years",2011,7.2000000000000008E-2]
[null,"Finland","Females","15 to 74 years",2012,7.0999999999999994E-2]
[null,"Finland","Females","15 to 74 years",2013,7.4999999999999997E-2]
[null,"Finland","Females","15 to 74 years",2014,7.8E-2]
[null,"Finland","Females","15 to 74 years",2015,8.5999999999999993E-2]
[null,"Finland","Females","15 to 74 years",2016,8.4000000000000005E-2]
[null,"Finland","Females","15 to 74 years",2017,8.3000000000000004E-2]
[null,"Finland","Females","15 to 74 years",2018,7.2000000000000008E-2]
[null,"Finland","Females","15 to 74 years",2019,6.2E-2]
[null,"Finland","Females","15 to 74 years",2020,7.400000000000001E-2]
[null,"Finland","Females","15 to 74 years",2021,7.0999999999999994E-2]
[null,"Finland","Females","15 to 74 years",2022,6.4000000000000001E-2]
[null,"Finland","Females","15 to 74 years",2023,6.5000000000000002E-2]
[null,"Finland","Females","15 to 74 years",2024,7.5999999999999998E-2]
[null,"France","Females","15 to 74 years",2010,9.5000000000000001E-2]
[null,"France","Females","15 to 74 years",2011,9.5000000000000001E-2]
[null,"France","Females","15 to 74 years",2012,9.6999999999999989E-2]
[null,"France","Females","15 to 74 years",2013,0.10199999999999999]
[null,"France","Females","15 to 74 years",2014,0.1]
[null,"France","Females","15 to 74 years",2015,9.9000000000000005E-2]
[null,"France","Females","15 to 74 years",2016,9.8000000000000004E-2]
[null,"France","Females","15 to 74 years",2017,9.4E-2]
[null,"France","Females","15 to 74 years",2018,0.09]
[null,"France","Females","15 to 74 years",2019,8.4000000000000005E-2]
[null,"France","Females","15 to 74 years",2020,0.08]
[null,"France","Females","15 to 74 years",2021,7.8E-2]
[null,"France","Females","15 to 74 years",2022,7.0999999999999994E-2]
[null,"France","Females","15 to 74 years",2023,7.2000000000000008E-2]
[null,"France","Females","15 to 74 years",2024,7.2000000000000008E-2]
[null,"Germany","Females","15 to 74 years",2010,6.0999999999999999E-2]
[null,"Germany","Females","15 to 74 years",2011,5.2999999999999999E-2]
[null,"Germany","Females","15 to 74 years",2012,4.9000000000000002E-2]
[null,"Germany","Females","15 to 74 years",2013,4.5999999999999999E-2]
[null,"Germany","Females","15 to 74 years",2014,4.4000000000000004E-2]
[null,"Germany","Females","15 to 74 years",2015,0.04]
[null,"Germany","Females","15 to 74 years",2016,3.5000000000000003E-2]
[null,"Germany","Females","15 to 74 years",2017,3.1E-2]
[null,"Germany","Females","15 to 74 years",2018,2.7000000000000003E-2]
[null,"Germany","Females","15 to 74 years",2019,2.6000000000000002E-2]
[null,"Germany","Females","15 to 74 years",2020,3.2000000000000001E-2]
[null,"Germany","Females","15 to 74 years",2021,3.2000000000000001E-2]
[null,"Germany","Females","15 to 74 years",2022,2.8999999999999998E-2]
[null,"Germany","Females","15 to 74 years",2023,2.7999999999999997E-2]
[null,"Germany","Females","15 to 74 years",2024,3.1E-2]
[null,"Greece","Females","15 to 74 years",2010,0.16699999999999998]
[null,"Greece","Females","15 to 74 years",2011,0.218]
[null,"Greece","Females","15 to 74 years",2012,0.28600000000000003]
[null,"Greece","Females","15 to 74 years",2013,0.317]
[null,"Greece","Females","15 to 74 years",2014,0.30399999999999999]
[null,"Greece","Females","15 to 74 years",2015,0.28999999999999998]
[null,"Greece","Females","15 to 74 years",2016,0.28499999999999998]
[null,"Greece","Females","15 to 74 years",2017,0.26400000000000001]
[null,"Greece","Females","15 to 74 years",2018,0.247]
[null,"Greece","Females","15 to 74 years",2019,0.22399999999999998]
[null,"Greece","Females","15 to 74 years",2020,0.215]
[null,"Greece","Females","15 to 74 years",2021,0.18899999999999997]
[null,"Greece","Females","15 to 74 years",2022,0.16399999999999998]
[null,"Greece","Females","15 to 74 years",2023,0.14300000000000002]
[null,"Greece","Females","15 to 74 years",2024,0.128]
[null,"Hungary","Females","15 to 74 years",2010,9.9000000000000005E-2]
[null,"Hungary","Females","15 to 74 years",2011,0.10199999999999999]
[null,"Hungary","Females","15 to 74 years",2012,9.9000000000000005E-2]
[null,"Hungary","Females","15 to 74 years",2013,9.5000000000000001E-2]
[null,"Hungary","Females","15 to 74 years",2014,7.4999999999999997E-2]
[null,"Hungary","Females","15 to 74 years",2015,6.6000000000000003E-2]
[null,"Hungary","Females","15 to 74 years",2016,4.8000000000000001E-2]
[null,"Hungary","Females","15 to 74 years",2017,4.2999999999999997E-2]
[null,"Hungary","Females","15 to 74 years",2018,3.7000000000000005E-2]
[null,"Hungary","Females","15 to 74 years",2019,3.3000000000000002E-2]
[null,"Hungary","Females","15 to 74 years",2020,4.0999999999999995E-2]
[null,"Hungary","Females","15 to 74 years",2021,4.2000000000000003E-2]
[null,"Hungary","Females","15 to 74 years",2022,3.5000000000000003E-2]
[null,"Hungary","Females","15 to 74 years",2023,4.2000000000000003E-2]
[null,"Hungary","Females","15 to 74 years",2024,4.4000000000000004E-2]
[null,"Ireland","Females","15 to 74 years",2010,0.114]
[null,"Ireland","Females","15 to 74 years",2011,0.125]
[null,"Ireland","Females","15 to 74 years",2012,0.128]
[null,"Ireland","Females","15 to 74 years",2013,0.124]
[null,"Ireland","Females","15 to 74 years",2014,0.109]
[null,"Ireland","Females","15 to 74 years",2015,8.900000000000001E-2]
[null,"Ireland","Females","15 to 74 years",2016,7.5999999999999998E-2]
[null,"Ireland","Females","15 to 74 years",2017,6.3E-2]
[null,"Ireland","Females","15 to 74 years",2018,5.7000000000000002E-2]
[null,"Ireland","Females","15 to 74 years",2019,4.7E-2]
[null,"Ireland","Females","15 to 74 years",2020,5.9000000000000004E-2]
[null,"Ireland","Females","15 to 74 years",2021,6.0999999999999999E-2]
[null,"Ireland","Females","15 to 74 years",2022,4.5999999999999999E-2]
[null,"Ireland","Females","15 to 74 years",2023,4.2000000000000003E-2]
[null,"Ireland","Females","15 to 74 years",2024,4.2999999999999997E-2]
[null,"Italy","Females","15 to 74 years",2010,9.6999999999999989E-2]
[null,"Italy","Females","15 to 74 years",2011,9.6999999999999989E-2]
[null,"Italy","Females","15 to 74 years",2012,0.12]
[null,"Italy","Females","15 to 74 years",2013,0.13200000000000001]
[null,"Italy","Females","15 to 74 years",2014,0.13900000000000001]
[null,"Italy","Females","15 to 74 years",2015,0.127]
[null,"Italy","Females","15 to 74 years",2016,0.128]
[null,"Italy","Females","15 to 74 years",2017,0.124]
[null,"Italy","Females","15 to 74 years",2018,0.11699999999999999]
[null,"Italy","Females","15 to 74 years",2019,0.111]
[null,"Italy","Females","15 to 74 years",2020,0.10400000000000001]
[null,"Italy","Females","15 to 74 years",2021,0.106]
[null,"Italy","Females","15 to 74 years",2022,9.4E-2]
[null,"Italy","Females","15 to 74 years",2023,8.8000000000000009E-2]
[null,"Italy","Females","15 to 74 years",2024,7.2999999999999995E-2]
[null,"Latvia","Females","15 to 74 years",2010,0.16500000000000001]
[null,"Latvia","Females","15 to 74 years",2011,0.13800000000000001]
[null,"Latvia","Females","15 to 74 years",2012,0.14000000000000001]
[null,"Latvia","Females","15 to 74 years",2013,0.11199999999999999]
[null,"Latvia","Females","15 to 74 years",2014,9.9000000000000005E-2]
[null,"Latvia","Females","15 to 74 years",2015,8.6999999999999994E-2]
[null,"Latvia","Females","15 to 74 years",2016,8.5000000000000006E-2]
[null,"Latvia","Females","15 to 74 years",2017,7.6999999999999999E-2]
[null,"Latvia","Females","15 to 74 years",2018,6.5000000000000002E-2]
[null,"Latvia","Females","15 to 74 years",2019,5.4000000000000006E-2]
[null,"Latvia","Females","15 to 74 years",2020,7.0999999999999994E-2]
[null,"Latvia","Females","15 to 74 years",2021,6.6000000000000003E-2]
[null,"Latvia","Females","15 to 74 years",2022,5.5999999999999994E-2]
[null,"Latvia","Females","15 to 74 years",2023,5.4000000000000006E-2]
[null,"Latvia","Females","15 to 74 years",2024,5.7999999999999996E-2]
[null,"Lithuania","Females","15 to 74 years",2010,0.14499999999999999]
[null,"Lithuania","Females","15 to 74 years",2011,0.129]
[null,"Lithuania","Females","15 to 74 years",2012,0.11599999999999999]
[null,"Lithuania","Females","15 to 74 years",2013,0.105]
[null,"Lithuania","Females","15 to 74 years",2014,9.1999999999999998E-2]
[null,"Lithuania","Females","15 to 74 years",2015,8.199999999999999E-2]
[null,"Lithuania","Females","15 to 74 years",2016,6.7000000000000004E-2]
[null,"Lithuania","Females","15 to 74 years",2017,5.7000000000000002E-2]
[null,"Lithuania","Females","15 to 74 years",2018,5.4000000000000006E-2]
[null,"Lithuania","Females","15 to 74 years",2019,5.5E-2]
[null,"Lithuania","Females","15 to 74 years",2020,7.6999999999999999E-2]
[null,"Lithuania","Females","15 to 74 years",2021,6.6000000000000003E-2]
[null,"Lithuania","Females","15 to 74 years",2022,5.5E-2]
[null,"Lithuania","Females","15 to 74 years",2023,6.4000000000000001E-2]
[null,"Lithuania","Females","15 to 74 years",2024,6.5000000000000002E-2]
[null,"Luxembourg","Females","15 to 74 years",2010,5.0999999999999997E-2]
[null,"Luxembourg","Females","15 to 74 years",2011,6.3E-2]
[null,"Luxembourg","Females","15 to 74 years",2012,5.9000000000000004E-2]
[null,"Luxembourg","Females","15 to 74 years",2013,6.4000000000000001E-2]
[null,"Luxembourg","Females","15 to 74 years",2014,5.7999999999999996E-2]
[null,"Luxembourg","Females","15 to 74 years",2015,7.400000000000001E-2]
[null,"Luxembourg","Females","15 to 74 years",2016,6.6000000000000003E-2]
[null,"Luxembourg","Females","15 to 74 years",2017,5.5E-2]
[null,"Luxembourg","Females","15 to 74 years",2018,5.9000000000000004E-2]
[null,"Luxembourg","Females","15 to 74 years",2019,5.5E-2]
[null,"Luxembourg","Females","15 to 74 years",2020,7.0000000000000007E-2]
[null,"Luxembourg","Females","15 to 74 years",2021,5.5999999999999994E-2]
[null,"Luxembourg","Females","15 to 74 years",2022,4.7E-2]
[null,"Luxembourg","Females","15 to 74 years",2023,5.4000000000000006E-2]
[null,"Luxembourg","Females","15 to 74 years",2024,6.3E-2]
[null,"Malta","Females","15 to 74 years",2010,7.0999999999999994E-2]
[null,"Malta","Females","15 to 74 years",2011,7.0999999999999994E-2]
[null,"Malta","Females","15 to 74 years",2012,7.2000000000000008E-2]
[null,"Malta","Females","15 to 74 years",2013,6.0999999999999999E-2]
[null,"Malta","Females","15 to 74 years",2014,5.0999999999999997E-2]
[null,"Malta","Females","15 to 74 years",2015,5.4000000000000006E-2]
[null,"Malta","Females","15 to 74 years",2016,5.2000000000000005E-2]
[null,"Malta","Females","15 to 74 years",2017,4.2999999999999997E-2]
[null,"Malta","Females","15 to 74 years",2018,3.7000000000000005E-2]
[null,"Malta","Females","15 to 74 years",2019,4.7E-2]
[null,"Malta","Females","15 to 74 years",2020,5.0999999999999997E-2]
[null,"Malta","Females","15 to 74 years",2021,3.6000000000000004E-2]
[null,"Malta","Females","15 to 74 years",2022,3.1E-2]
[null,"Malta","Females","15 to 74 years",2023,3.2000000000000001E-2]
[null,"Malta","Females","15 to 74 years",2024,0.03]
[null,"Netherlands","Females","15 to 74 years",2010,6.7000000000000004E-2]
[null,"Netherlands","Females","15 to 74 years",2011,6.6000000000000003E-2]
[null,"Netherlands","Females","15 to 74 years",2012,7.400000000000001E-2]
[null,"Netherlands","Females","15 to 74 years",2013,8.4000000000000005E-2]
[null,"Netherlands","Females","15 to 74 years",2014,8.8000000000000009E-2]
[null,"Netherlands","Females","15 to 74 years",2015,8.4000000000000005E-2]
[null,"Netherlands","Females","15 to 74 years",2016,7.5999999999999998E-2]
[null,"Netherlands","Females","15 to 74 years",2017,6.4000000000000001E-2]
[null,"Netherlands","Females","15 to 74 years",2018,5.0999999999999997E-2]
[null,"Netherlands","Females","15 to 74 years",2019,4.4999999999999998E-2]
[null,"Netherlands","Females","15 to 74 years",2020,5.0999999999999997E-2]
[null,"Netherlands","Females","15 to 74 years",2021,4.4999999999999998E-2]
[null,"Netherlands","Females","15 to 74 years",2022,3.7999999999999999E-2]
[null,"Netherlands","Females","15 to 74 years",2023,3.7999999999999999E-2]
[null,"Netherlands","Females","15 to 74 years",2024,3.7999999999999999E-2]
[null,"Poland","Females","15 to 74 years",2010,0.10300000000000001]
[null,"Poland","Females","15 to 74 years",2011,0.107]
[null,"Poland","Females","15 to 74 years",2012,0.11199999999999999]
[null,"Poland","Females","15 to 74 years",2013,0.114]
[null,"Poland","Females","15 to 74 years",2014,9.8000000000000004E-2]
[null,"Poland","Females","15 to 74 years",2015,7.8E-2]
[null,"Poland","Females","15 to 74 years",2016,6.3E-2]
[null,"Poland","Females","15 to 74 years",2017,0.05]
[null,"Poland","Females","15 to 74 years",2018,3.9E-2]
[null,"Poland","Females","15 to 74 years",2019,3.6000000000000004E-2]
[null,"Poland","Females","15 to 74 years",2020,3.3000000000000002E-2]
[null,"Poland","Females","15 to 74 years",2021,3.4000000000000002E-2]
[null,"Poland","Females","15 to 74 years",2022,2.8999999999999998E-2]
[null,"Poland","Females","15 to 74 years",2023,2.8999999999999998E-2]
[null,"Poland","Females","15 to 74 years",2024,3.1E-2]
[null,"Portugal","Females","15 to 74 years",2010,0.129]
[null,"Portugal","Females","15 to 74 years",2011,0.13900000000000001]
[null,"Portugal","Females","15 to 74 years",2012,0.16399999999999998]
[null,"Portugal","Females","15 to 74 years",2013,0.17300000000000001]
[null,"Portugal","Females","15 to 74 years",2014,0.14800000000000002]
[null,"Portugal","Females","15 to 74 years",2015,0.13100000000000001]
[null,"Portugal","Females","15 to 74 years",2016,0.114]
[null,"Portugal","Females","15 to 74 years",2017,9.6000000000000002E-2]
[null,"Portugal","Females","15 to 74 years",2018,7.5999999999999998E-2]
[null,"Portugal","Females","15 to 74 years",2019,7.2000000000000008E-2]
[null,"Portugal","Females","15 to 74 years",2020,7.2000000000000008E-2]
[null,"Portugal","Females","15 to 74 years",2021,7.0000000000000007E-2]
[null,"Portugal","Females","15 to 74 years",2022,6.6000000000000003E-2]
[null,"Portugal","Females","15 to 74 years",2023,6.9000000000000006E-2]
[null,"Portugal","Females","15 to 74 years",2024,6.9000000000000006E-2]
[null,"Romania","Females","15 to 74 years",2010,8.3000000000000004E-2]
[null,"Romania","Females","15 to 74 years",2011,8.5000000000000006E-2]
[null,"Romania","Females","15 to 74 years",2012,8.1000000000000003E-2]
[null,"Romania","Females","15 to 74 years",2013,8.3000000000000004E-2]
[null,"Romania","Females","15 to 74 years",2014,7.9000000000000001E-2]
[null,"Romania","Females","15 to 74 years",2015,7.400000000000001E-2]
[null,"Romania","Females","15 to 74 years",2016,6.2E-2]
[null,"Romania","Females","15 to 74 years",2017,5.0999999999999997E-2]
[null,"Romania","Females","15 to 74 years",2018,4.4999999999999998E-2]
[null,"Romania","Females","15 to 74 years",2019,4.2999999999999997E-2]
[null,"Romania","Females","15 to 74 years",2020,5.7000000000000002E-2]
[null,"Romania","Females","15 to 74 years",2021,5.0999999999999997E-2]
[null,"Romania","Females","15 to 74 years",2022,5.0999999999999997E-2]
[null,"Romania","Females","15 to 74 years",2023,5.0999999999999997E-2]
[null,"Romania","Females","15 to 74 years",2024,5.0999999999999997E-2]
[null,"Slovakia","Females","15 to 74 years",2010,0.14800000000000002]
[null,"Slovakia","Females","15 to 74 years",2011,0.13800000000000001]
[null,"Slovakia","Females","15 to 74 years",2012,0.14699999999999999]
[null,"Slovakia","Females","15 to 74 years",2013,0.14699999999999999]
[null,"Slovakia","Females","15 to 74 years",2014,0.13699999999999998]
[null,"Slovakia","Females","15 to 74 years",2015,0.13]
[null,"Slovakia","Females","15 to 74 years",2016,0.109]
[null,"Slovakia","Females","15 to 74 years",2017,8.5000000000000006E-2]
[null,"Slovakia","Females","15 to 74 years",2018,7.0999999999999994E-2]
[null,"Slovakia","Females","15 to 74 years",2019,0.06]
[null,"Slovakia","Females","15 to 74 years",2020,7.0999999999999994E-2]
[null,"Slovakia","Females","15 to 74 years",2021,7.0000000000000007E-2]
[null,"Slovakia","Females","15 to 74 years",2022,6.4000000000000001E-2]
[null,"Slovakia","Females","15 to 74 years",2023,5.9000000000000004E-2]
[null,"Slovakia","Females","15 to 74 years",2024,5.9000000000000004E-2]
[null,"Slovenia","Females","15 to 74 years",2010,7.0000000000000007E-2]
[null,"Slovenia","Females","15 to 74 years",2011,8.199999999999999E-2]
[null,"Slovenia","Females","15 to 74 years",2012,9.4E-2]
[null,"Slovenia","Females","15 to 74 years",2013,0.109]
[null,"Slovenia","Females","15 to 74 years",2014,0.106]
[null,"Slovenia","Females","15 to 74 years",2015,0.10099999999999999]
[null,"Slovenia","Females","15 to 74 years",2016,8.5999999999999993E-2]
[null,"Slovenia","Females","15 to 74 years",2017,7.4999999999999997E-2]
[null,"Slovenia","Females","15 to 74 years",2018,5.7000000000000002E-2]
[null,"Slovenia","Females","15 to 74 years",2019,0.05]
[null,"Slovenia","Females","15 to 74 years",2020,5.7000000000000002E-2]
[null,"Slovenia","Females","15 to 74 years",2021,5.2999999999999999E-2]
[null,"Slovenia","Females","15 to 74 years",2022,4.2999999999999997E-2]
[null,"Slovenia","Females","15 to 74 years",2023,3.7000000000000005E-2]
[null,"Slovenia","Females","15 to 74 years",2024,0.04]
[null,"Spain","Females","15 to 74 years",2010,0.20199999999999999]
[null,"Spain","Females","15 to 74 years",2011,0.218]
[null,"Spain","Females","15 to 74 years",2012,0.251]
[null,"Spain","Females","15 to 74 years",2013,0.26700000000000002]
[null,"Spain","Females","15 to 74 years",2014,0.254]
[null,"Spain","Females","15 to 74 years",2015,0.23600000000000002]
[null,"Spain","Females","15 to 74 years",2016,0.214]
[null,"Spain","Females","15 to 74 years",2017,0.19]
[null,"Spain","Females","15 to 74 years",2018,0.17]
[null,"Spain","Females","15 to 74 years",2019,0.16]
[null,"Spain","Females","15 to 74 years",2020,0.17399999999999999]
[null,"Spain","Females","15 to 74 years",2021,0.16800000000000001]
[null,"Spain","Females","15 to 74 years",2022,0.14899999999999999]
[null,"Spain","Females","15 to 74 years",2023,0.13900000000000001]
[null,"Spain","Females","15 to 74 years",2024,0.127]
[null,"Sweden","Females","15 to 74 years",2010,8.6999999999999994E-2]
[null,"Sweden","Females","15 to 74 years",2011,7.9000000000000001E-2]
[null,"Sweden","Females","15 to 74 years",2012,7.9000000000000001E-2]
[null,"Sweden","Females","15 to 74 years",2013,0.08]
[null,"Sweden","Females","15 to 74 years",2014,7.8E-2]
[null,"Sweden","Females","15 to 74 years",2015,7.400000000000001E-2]
[null,"Sweden","Females","15 to 74 years",2016,6.7000000000000004E-2]
[null,"Sweden","Females","15 to 74 years",2017,6.5000000000000002E-2]
[null,"Sweden","Females","15 to 74 years",2018,6.4000000000000001E-2]
[null,"Sweden","Females","15 to 74 years",2019,7.0999999999999994E-2]
[null,"Sweden","Females","15 to 74 years",2020,8.5000000000000006E-2]
[null,"Sweden","Females","15 to 74 years",2021,9.1999999999999998E-2]
[null,"Sweden","Females","15 to 74 years",2022,7.9000000000000001E-2]
[null,"Sweden","Females","15 to 74 years",2023,7.9000000000000001E-2]
[null,"Sweden","Females","15 to 74 years",2024,8.5000000000000006E-2]
[null,"Austria","Females","20 to 64 years",2010,4.4999999999999998E-2]
[null,"Austria","Females","20 to 64 years",2011,4.4999999999999998E-2]
[null,"Austria","Females","20 to 64 years",2012,4.7E-2]
[null,"Austria","Females","20 to 64 years",2013,5.2000000000000005E-2]
[null,"Austria","Females","20 to 64 years",2014,5.4000000000000006E-2]
[null,"Austria","Females","20 to 64 years",2015,5.4000000000000006E-2]
[null,"Austria","Females","20 to 64 years",2016,5.5E-2]
[null,"Austria","Females","20 to 64 years",2017,0.05]
[null,"Austria","Females","20 to 64 years",2018,4.7E-2]
[null,"Austria","Females","20 to 64 years",2019,4.4000000000000004E-2]
[null,"Austria","Females","20 to 64 years",2020,5.7000000000000002E-2]
[null,"Austria","Females","20 to 64 years",2021,5.9000000000000004E-2]
[null,"Austria","Females","20 to 64 years",2022,4.2000000000000003E-2]
[null,"Austria","Females","20 to 64 years",2023,4.4999999999999998E-2]
[null,"Austria","Females","20 to 64 years",2024,4.4000000000000004E-2]
[null,"Belgium","Females","20 to 64 years",2010,8.3000000000000004E-2]
[null,"Belgium","Females","20 to 64 years",2011,7.0000000000000007E-2]
[null,"Belgium","Females","20 to 64 years",2012,7.400000000000001E-2]
[null,"Belgium","Females","20 to 64 years",2013,8.1000000000000003E-2]
[null,"Belgium","Females","20 to 64 years",2014,7.9000000000000001E-2]
[null,"Belgium","Females","20 to 64 years",2015,7.8E-2]
[null,"Belgium","Females","20 to 64 years",2016,7.4999999999999997E-2]
[null,"Belgium","Females","20 to 64 years",2017,7.0999999999999994E-2]
[null,"Belgium","Females","20 to 64 years",2018,5.4000000000000006E-2]
[null,"Belgium","Females","20 to 64 years",2019,4.8000000000000001E-2]
[null,"Belgium","Females","20 to 64 years",2020,5.2999999999999999E-2]
[null,"Belgium","Females","20 to 64 years",2021,5.7000000000000002E-2]
[null,"Belgium","Females","20 to 64 years",2022,0.05]
[null,"Belgium","Females","20 to 64 years",2023,4.8000000000000001E-2]
[null,"Belgium","Females","20 to 64 years",2024,4.9000000000000002E-2]
[null,"Bulgaria","Females","20 to 64 years",2010,0.10300000000000001]
[null,"Bulgaria","Females","20 to 64 years",2011,0.10800000000000001]
[null,"Bulgaria","Females","20 to 64 years",2012,0.114]
[null,"Bulgaria","Females","20 to 64 years",2013,0.126]
[null,"Bulgaria","Females","20 to 64 years",2014,0.11199999999999999]
[null,"Bulgaria","Females","20 to 64 years",2015,9.1999999999999998E-2]
[null,"Bulgaria","Females","20 to 64 years",2016,7.9000000000000001E-2]
[null,"Bulgaria","Females","20 to 64 years",2017,6.8000000000000005E-2]
[null,"Bulgaria","Females","20 to 64 years",2018,5.5999999999999994E-2]
[null,"Bulgaria","Females","20 to 64 years",2019,4.8000000000000001E-2]
[null,"Bulgaria","Females","20 to 64 years",2020,5.7000000000000002E-2]
[null,"Bulgaria","Females","20 to 64 years",2021,4.9000000000000002E-2]
[null,"Bulgaria","Females","20 to 64 years",2022,3.9E-2]
[null,"Bulgaria","Females","20 to 64 years",2023,4.2000000000000003E-2]
[null,"Bulgaria","Females","20 to 64 years",2024,3.9E-2]
[null,"Croatia","Females","20 to 64 years",2010,0.11900000000000001]
[null,"Croatia","Females","20 to 64 years",2011,0.13300000000000001]
[null,"Croatia","Females","20 to 64 years",2012,0.154]
[null,"Croatia","Females","20 to 64 years",2013,0.161]
[null,"Croatia","Females","20 to 64 years",2014,0.17600000000000002]
[null,"Croatia","Females","20 to 64 years",2015,0.16399999999999998]
[null,"Croatia","Females","20 to 64 years",2016,0.13200000000000001]
[null,"Croatia","Females","20 to 64 years",2017,0.115]
[null,"Croatia","Females","20 to 64 years",2018,0.09]
[null,"Croatia","Females","20 to 64 years",2019,6.9000000000000006E-2]
[null,"Croatia","Females","20 to 64 years",2020,7.0000000000000007E-2]
[null,"Croatia","Females","20 to 64 years",2021,7.5999999999999998E-2]
[null,"Croatia","Females","20 to 64 years",2022,7.4999999999999997E-2]
[null,"Croatia","Females","20 to 64 years",2023,6.3E-2]
[null,"Croatia","Females","20 to 64 years",2024,4.5999999999999999E-2]
[null,"Cyprus","Females","20 to 64 years",2010,6.3E-2]
[null,"Cyprus","Females","20 to 64 years",2011,7.4999999999999997E-2]
[null,"Cyprus","Females","20 to 64 years",2012,0.11]
[null,"Cyprus","Females","20 to 64 years",2013,0.151]
[null,"Cyprus","Females","20 to 64 years",2014,0.14899999999999999]
[null,"Cyprus","Females","20 to 64 years",2015,0.14599999999999999]
[null,"Cyprus","Females","20 to 64 years",2016,0.13100000000000001]
[null,"Cyprus","Females","20 to 64 years",2017,0.11199999999999999]
[null,"Cyprus","Females","20 to 64 years",2018,8.6999999999999994E-2]
[null,"Cyprus","Females","20 to 64 years",2019,7.6999999999999999E-2]
[null,"Cyprus","Females","20 to 64 years",2020,7.4999999999999997E-2]
[null,"Cyprus","Females","20 to 64 years",2021,7.2000000000000008E-2]
[null,"Cyprus","Females","20 to 64 years",2022,6.7000000000000004E-2]
[null,"Cyprus","Females","20 to 64 years",2023,5.9000000000000004E-2]
[null,"Cyprus","Females","20 to 64 years",2024,5.0999999999999997E-2]
[null,"Czechia","Females","20 to 64 years",2010,8.3000000000000004E-2]
[null,"Czechia","Females","20 to 64 years",2011,7.6999999999999999E-2]
[null,"Czechia","Females","20 to 64 years",2012,8.1000000000000003E-2]
[null,"Czechia","Females","20 to 64 years",2013,8.199999999999999E-2]
[null,"Czechia","Females","20 to 64 years",2014,7.2999999999999995E-2]
[null,"Czechia","Females","20 to 64 years",2015,0.06]
[null,"Czechia","Females","20 to 64 years",2016,4.5999999999999999E-2]
[null,"Czechia","Females","20 to 64 years",2017,3.5000000000000003E-2]
[null,"Czechia","Females","20 to 64 years",2018,2.7999999999999997E-2]
[null,"Czechia","Females","20 to 64 years",2019,2.3E-2]
[null,"Czechia","Females","20 to 64 years",2020,2.8999999999999998E-2]
[null,"Czechia","Females","20 to 64 years",2021,3.4000000000000002E-2]
[null,"Czechia","Females","20 to 64 years",2022,2.7000000000000003E-2]
[null,"Czechia","Females","20 to 64 years",2023,0.03]
[null,"Czechia","Females","20 to 64 years",2024,2.8999999999999998E-2]
[null,"Denmark","Females","20 to 64 years",2010,6.0999999999999999E-2]
[null,"Denmark","Females","20 to 64 years",2011,6.9000000000000006E-2]
[null,"Denmark","Females","20 to 64 years",2012,7.2000000000000008E-2]
[null,"Denmark","Females","20 to 64 years",2013,7.2000000000000008E-2]
[null,"Denmark","Females","20 to 64 years",2014,6.8000000000000005E-2]
[null,"Denmark","Females","20 to 64 years",2015,6.3E-2]
[null,"Denmark","Females","20 to 64 years",2016,0.06]
[null,"Denmark","Females","20 to 64 years",2017,5.5999999999999994E-2]
[null,"Denmark","Females","20 to 64 years",2018,0.05]
[null,"Denmark","Females","20 to 64 years",2019,4.9000000000000002E-2]
[null,"Denmark","Females","20 to 64 years",2020,5.5999999999999994E-2]
[null,"Denmark","Females","20 to 64 years",2021,4.8000000000000001E-2]
[null,"Denmark","Females","20 to 64 years",2022,4.0999999999999995E-2]
[null,"Denmark","Females","20 to 64 years",2023,4.8000000000000001E-2]
[null,"Denmark","Females","20 to 64 years",2024,5.7000000000000002E-2]
[null,"Estonia","Females","20 to 64 years",2010,0.13900000000000001]
[null,"Estonia","Females","20 to 64 years",2011,0.114]
[null,"Estonia","Females","20 to 64 years",2012,8.900000000000001E-2]
[null,"Estonia","Females","20 to 64 years",2013,8.1000000000000003E-2]
[null,"Estonia","Females","20 to 64 years",2014,6.8000000000000005E-2]
[null,"Estonia","Females","20 to 64 years",2015,6.0999999999999999E-2]
[null,"Estonia","Females","20 to 64 years",2016,6.2E-2]
[null,"Estonia","Females","20 to 64 years",2017,5.2000000000000005E-2]
[null,"Estonia","Females","20 to 64 years",2018,5.0999999999999997E-2]
[null,"Estonia","Females","20 to 64 years",2019,4.9000000000000002E-2]
[null,"Estonia","Females","20 to 64 years",2020,6.7000000000000004E-2]
[null,"Estonia","Females","20 to 64 years",2021,5.5E-2]
[null,"Estonia","Females","20 to 64 years",2022,0.05]
[null,"Estonia","Females","20 to 64 years",2023,6.5000000000000002E-2]
[null,"Estonia","Females","20 to 64 years",2024,7.4999999999999997E-2]
[null,"Finland","Females","20 to 64 years",2010,6.8000000000000005E-2]
[null,"Finland","Females","20 to 64 years",2011,6.3E-2]
[null,"Finland","Females","20 to 64 years",2012,6.2E-2]
[null,"Finland","Females","20 to 64 years",2013,6.7000000000000004E-2]
[null,"Finland","Females","20 to 64 years",2014,7.0000000000000007E-2]
[null,"Finland","Females","20 to 64 years",2015,0.08]
[null,"Finland","Females","20 to 64 years",2016,7.5999999999999998E-2]
[null,"Finland","Females","20 to 64 years",2017,7.4999999999999997E-2]
[null,"Finland","Females","20 to 64 years",2018,6.5000000000000002E-2]
[null,"Finland","Females","20 to 64 years",2019,5.5E-2]
[null,"Finland","Females","20 to 64 years",2020,6.6000000000000003E-2]
[null,"Finland","Females","20 to 64 years",2021,6.3E-2]
[null,"Finland","Females","20 to 64 years",2022,5.7000000000000002E-2]
[null,"Finland","Females","20 to 64 years",2023,5.7000000000000002E-2]
[null,"Finland","Females","20 to 64 years",2024,6.7000000000000004E-2]
[null,"France","Females","20 to 64 years",2010,8.900000000000001E-2]
[null,"France","Females","20 to 64 years",2011,0.09]
[null,"France","Females","20 to 64 years",2012,9.1999999999999998E-2]
[null,"France","Females","20 to 64 years",2013,9.6000000000000002E-2]
[null,"France","Females","20 to 64 years",2014,9.4E-2]
[null,"France","Females","20 to 64 years",2015,9.4E-2]
[null,"France","Females","20 to 64 years",2016,9.3000000000000013E-2]
[null,"France","Females","20 to 64 years",2017,8.900000000000001E-2]
[null,"France","Females","20 to 64 years",2018,8.6999999999999994E-2]
[null,"France","Females","20 to 64 years",2019,7.9000000000000001E-2]
[null,"France","Females","20 to 64 years",2020,7.5999999999999998E-2]
[null,"France","Females","20 to 64 years",2021,7.400000000000001E-2]
[null,"France","Females","20 to 64 years",2022,6.8000000000000005E-2]
[null,"France","Females","20 to 64 years",2023,6.8000000000000005E-2]
[null,"France","Females","20 to 64 years",2024,6.8000000000000005E-2]
[null,"Germany","Females","20 to 64 years",2010,6.0999999999999999E-2]
[null,"Germany","Females","20 to 64 years",2011,5.2000000000000005E-2]
[null,"Germany","Females","20 to 64 years",2012,4.8000000000000001E-2]
[null,"Germany","Females","20 to 64 years",2013,4.5999999999999999E-2]
[null,"Germany","Females","20 to 64 years",2014,4.2999999999999997E-2]
[null,"Germany","Females","20 to 64 years",2015,3.9E-2]
[null,"Germany","Females","20 to 64 years",2016,3.4000000000000002E-2]
[null,"Germany","Females","20 to 64 years",2017,0.03]
[null,"Germany","Females","20 to 64 years",2018,2.7000000000000003E-2]
[null,"Germany","Females","20 to 64 years",2019,2.5000000000000001E-2]
[null,"Germany","Females","20 to 64 years",2020,3.1E-2]
[null,"Germany","Females","20 to 64 years",2021,3.1E-2]
[null,"Germany","Females","20 to 64 years",2022,2.7999999999999997E-2]
[null,"Germany","Females","20 to 64 years",2023,2.7999999999999997E-2]
[null,"Germany","Females","20 to 64 years",2024,3.1E-2]
[null,"Greece","Females","20 to 64 years",2010,0.16600000000000001]
[null,"Greece","Females","20 to 64 years",2011,0.21600000000000003]
[null,"Greece","Females","20 to 64 years",2012,0.28300000000000003]
[null,"Greece","Females","20 to 64 years",2013,0.315]
[null,"Greece","Females","20 to 64 years",2014,0.30299999999999999]
[null,"Greece","Females","20 to 64 years",2015,0.28999999999999998]
[null,"Greece","Females","20 to 64 years",2016,0.28600000000000003]
[null,"Greece","Females","20 to 64 years",2017,0.26400000000000001]
[null,"Greece","Females","20 to 64 years",2018,0.248]
[null,"Greece","Females","20 to 64 years",2019,0.22399999999999998]
[null,"Greece","Females","20 to 64 years",2020,0.21600000000000003]
[null,"Greece","Females","20 to 64 years",2021,0.19]
[null,"Greece","Females","20 to 64 years",2022,0.16399999999999998]
[null,"Greece","Females","20 to 64 years",2023,0.14300000000000002]
[null,"Greece","Females","20 to 64 years",2024,0.126]
[null,"Hungary","Females","20 to 64 years",2010,9.9000000000000005E-2]
[null,"Hungary","Females","20 to 64 years",2011,0.10199999999999999]
[null,"Hungary","Females","20 to 64 years",2012,9.8000000000000004E-2]
[null,"Hungary","Females","20 to 64 years",2013,9.3000000000000013E-2]
[null,"Hungary","Females","20 to 64 years",2014,7.2999999999999995E-2]
[null,"Hungary","Females","20 to 64 years",2015,6.5000000000000002E-2]
[null,"Hungary","Females","20 to 64 years",2016,4.7E-2]
[null,"Hungary","Females","20 to 64 years",2017,4.2000000000000003E-2]
[null,"Hungary","Females","20 to 64 years",2018,3.6000000000000004E-2]
[null,"Hungary","Females","20 to 64 years",2019,3.2000000000000001E-2]
[null,"Hungary","Females","20 to 64 years",2020,4.0999999999999995E-2]
[null,"Hungary","Females","20 to 64 years",2021,4.0999999999999995E-2]
[null,"Hungary","Females","20 to 64 years",2022,3.4000000000000002E-2]
[null,"Hungary","Females","20 to 64 years",2023,0.04]
[null,"Hungary","Females","20 to 64 years",2024,4.2000000000000003E-2]
[null,"Ireland","Females","20 to 64 years",2010,0.10800000000000001]
[null,"Ireland","Females","20 to 64 years",2011,0.12]
[null,"Ireland","Females","20 to 64 years",2012,0.121]
[null,"Ireland","Females","20 to 64 years",2013,0.11900000000000001]
[null,"Ireland","Females","20 to 64 years",2014,0.10400000000000001]
[null,"Ireland","Females","20 to 64 years",2015,8.5999999999999993E-2]
[null,"Ireland","Females","20 to 64 years",2016,7.2999999999999995E-2]
[null,"Ireland","Females","20 to 64 years",2017,5.9000000000000004E-2]
[null,"Ireland","Females","20 to 64 years",2018,5.2999999999999999E-2]
[null,"Ireland","Females","20 to 64 years",2019,4.2999999999999997E-2]
[null,"Ireland","Females","20 to 64 years",2020,5.5E-2]
[null,"Ireland","Females","20 to 64 years",2021,5.5E-2]
[null,"Ireland","Females","20 to 64 years",2022,4.2000000000000003E-2]
[null,"Ireland","Females","20 to 64 years",2023,3.7000000000000005E-2]
[null,"Ireland","Females","20 to 64 years",2024,3.9E-2]
[null,"Italy","Females","20 to 64 years",2010,9.4E-2]
[null,"Italy","Females","20 to 64 years",2011,9.3000000000000013E-2]
[null,"Italy","Females","20 to 64 years",2012,0.11599999999999999]
[null,"Italy","Females","20 to 64 years",2013,0.129]
[null,"Italy","Females","20 to 64 years",2014,0.13600000000000001]
[null,"Italy","Females","20 to 64 years",2015,0.125]
[null,"Italy","Females","20 to 64 years",2016,0.126]
[null,"Italy","Females","20 to 64 years",2017,0.122]
[null,"Italy","Females","20 to 64 years",2018,0.11599999999999999]
[null,"Italy","Females","20 to 64 years",2019,0.109]
[null,"Italy","Females","20 to 64 years",2020,0.10300000000000001]
[null,"Italy","Females","20 to 64 years",2021,0.105]
[null,"Italy","Females","20 to 64 years",2022,9.1999999999999998E-2]
[null,"Italy","Females","20 to 64 years",2023,8.6999999999999994E-2]
[null,"Italy","Females","20 to 64 years",2024,7.2999999999999995E-2]
[null,"Latvia","Females","20 to 64 years",2010,0.16300000000000001]
[null,"Latvia","Females","20 to 64 years",2011,0.13699999999999998]
[null,"Latvia","Females","20 to 64 years",2012,0.13900000000000001]
[null,"Latvia","Females","20 to 64 years",2013,0.11199999999999999]
[null,"Latvia","Females","20 to 64 years",2014,0.1]
[null,"Latvia","Females","20 to 64 years",2015,8.6999999999999994E-2]
[null,"Latvia","Females","20 to 64 years",2016,8.6999999999999994E-2]
[null,"Latvia","Females","20 to 64 years",2017,7.9000000000000001E-2]
[null,"Latvia","Females","20 to 64 years",2018,6.6000000000000003E-2]
[null,"Latvia","Females","20 to 64 years",2019,5.5999999999999994E-2]
[null,"Latvia","Females","20 to 64 years",2020,7.2999999999999995E-2]
[null,"Latvia","Females","20 to 64 years",2021,6.8000000000000005E-2]
[null,"Latvia","Females","20 to 64 years",2022,5.7999999999999996E-2]
[null,"Latvia","Females","20 to 64 years",2023,5.5999999999999994E-2]
[null,"Latvia","Females","20 to 64 years",2024,0.06]
[null,"Lithuania","Females","20 to 64 years",2010,0.14499999999999999]
[null,"Lithuania","Females","20 to 64 years",2011,0.13]
[null,"Lithuania","Females","20 to 64 years",2012,0.11699999999999999]
[null,"Lithuania","Females","20 to 64 years",2013,0.106]
[null,"Lithuania","Females","20 to 64 years",2014,9.3000000000000013E-2]
[null,"Lithuania","Females","20 to 64 years",2015,8.3000000000000004E-2]
[null,"Lithuania","Females","20 to 64 years",2016,6.8000000000000005E-2]
[null,"Lithuania","Females","20 to 64 years",2017,5.7999999999999996E-2]
[null,"Lithuania","Females","20 to 64 years",2018,5.5999999999999994E-2]
[null,"Lithuania","Females","20 to 64 years",2019,5.5999999999999994E-2]
[null,"Lithuania","Females","20 to 64 years",2020,7.9000000000000001E-2]
[null,"Lithuania","Females","20 to 64 years",2021,6.8000000000000005E-2]
[null,"Lithuania","Females","20 to 64 years",2022,5.5999999999999994E-2]
[null,"Lithuania","Females","20 to 64 years",2023,6.6000000000000003E-2]
[null,"Lithuania","Females","20 to 64 years",2024,6.6000000000000003E-2]
[null,"Luxembourg","Females","20 to 64 years",2010,5.0999999999999997E-2]
[null,"Luxembourg","Females","20 to 64 years",2011,6.0999999999999999E-2]
[null,"Luxembourg","Females","20 to 64 years",2012,5.7999999999999996E-2]
[null,"Luxembourg","Females","20 to 64 years",2013,6.2E-2]
[null,"Luxembourg","Females","20 to 64 years",2014,5.5999999999999994E-2]
[null,"Luxembourg","Females","20 to 64 years",2015,7.0999999999999994E-2]
[null,"Luxembourg","Females","20 to 64 years",2016,6.3E-2]
[null,"Luxembourg","Females","20 to 64 years",2017,5.2000000000000005E-2]
[null,"Luxembourg","Females","20 to 64 years",2018,5.5999999999999994E-2]
[null,"Luxembourg","Females","20 to 64 years",2019,5.2000000000000005E-2]
[null,"Luxembourg","Females","20 to 64 years",2020,6.6000000000000003E-2]
[null,"Luxembourg","Females","20 to 64 years",2021,5.2999999999999999E-2]
[null,"Luxembourg","Females","20 to 64 years",2022,4.0999999999999995E-2]
[null,"Luxembourg","Females","20 to 64 years",2023,4.5999999999999999E-2]
[null,"Luxembourg","Females","20 to 64 years",2024,5.7000000000000002E-2]
[null,"Malta","Females","20 to 64 years",2010,6.2E-2]
[null,"Malta","Females","20 to 64 years",2011,6.0999999999999999E-2]
[null,"Malta","Females","20 to 64 years",2012,0.06]
[null,"Malta","Females","20 to 64 years",2013,5.5E-2]
[null,"Malta","Females","20 to 64 years",2014,4.4999999999999998E-2]
[null,"Malta","Females","20 to 64 years",2015,4.8000000000000001E-2]
[null,"Malta","Females","20 to 64 years",2016,4.5999999999999999E-2]
[null,"Malta","Females","20 to 64 years",2017,3.7999999999999999E-2]
[null,"Malta","Females","20 to 64 years",2018,3.4000000000000002E-2]
[null,"Malta","Females","20 to 64 years",2019,4.4000000000000004E-2]
[null,"Malta","Females","20 to 64 years",2020,0.05]
[null,"Malta","Females","20 to 64 years",2021,3.3000000000000002E-2]
[null,"Malta","Females","20 to 64 years",2022,2.7999999999999997E-2]
[null,"Malta","Females","20 to 64 years",2023,0.03]
[null,"Malta","Females","20 to 64 years",2024,2.7000000000000003E-2]
[null,"Netherlands","Females","20 to 64 years",2010,0.06]
[null,"Netherlands","Females","20 to 64 years",2011,5.7999999999999996E-2]
[null,"Netherlands","Females","20 to 64 years",2012,6.5000000000000002E-2]
[null,"Netherlands","Females","20 to 64 years",2013,7.5999999999999998E-2]
[null,"Netherlands","Females","20 to 64 years",2014,8.1000000000000003E-2]
[null,"Netherlands","Females","20 to 64 years",2015,7.5999999999999998E-2]
[null,"Netherlands","Females","20 to 64 years",2016,6.9000000000000006E-2]
[null,"Netherlands","Females","20 to 64 years",2017,5.7000000000000002E-2]
[null,"Netherlands","Females","20 to 64 years",2018,4.4999999999999998E-2]
[null,"Netherlands","Females","20 to 64 years",2019,0.04]
[null,"Netherlands","Females","20 to 64 years",2020,4.4000000000000004E-2]
[null,"Netherlands","Females","20 to 64 years",2021,3.7000000000000005E-2]
[null,"Netherlands","Females","20 to 64 years",2022,3.1E-2]
[null,"Netherlands","Females","20 to 64 years",2023,3.1E-2]
[null,"Netherlands","Females","20 to 64 years",2024,3.3000000000000002E-2]
[null,"Poland","Females","20 to 64 years",2010,0.10099999999999999]
[null,"Poland","Females","20 to 64 years",2011,0.105]
[null,"Poland","Females","20 to 64 years",2012,0.11]
[null,"Poland","Females","20 to 64 years",2013,0.11199999999999999]
[null,"Poland","Females","20 to 64 years",2014,9.6999999999999989E-2]
[null,"Poland","Females","20 to 64 years",2015,7.8E-2]
[null,"Poland","Females","20 to 64 years",2016,6.2E-2]
[null,"Poland","Females","20 to 64 years",2017,4.9000000000000002E-2]
[null,"Poland","Females","20 to 64 years",2018,3.9E-2]
[null,"Poland","Females","20 to 64 years",2019,3.5000000000000003E-2]
[null,"Poland","Females","20 to 64 years",2020,3.3000000000000002E-2]
[null,"Poland","Females","20 to 64 years",2021,3.4000000000000002E-2]
[null,"Poland","Females","20 to 64 years",2022,2.8999999999999998E-2]
[null,"Poland","Females","20 to 64 years",2023,2.7999999999999997E-2]
[null,"Poland","Females","20 to 64 years",2024,0.03]
[null,"Portugal","Females","20 to 64 years",2010,0.122]
[null,"Portugal","Females","20 to 64 years",2011,0.13500000000000001]
[null,"Portugal","Females","20 to 64 years",2012,0.16]
[null,"Portugal","Females","20 to 64 years",2013,0.17]
[null,"Portugal","Females","20 to 64 years",2014,0.14599999999999999]
[null,"Portugal","Females","20 to 64 years",2015,0.128]
[null,"Portugal","Females","20 to 64 years",2016,0.113]
[null,"Portugal","Females","20 to 64 years",2017,9.4E-2]
[null,"Portugal","Females","20 to 64 years",2018,7.400000000000001E-2]
[null,"Portugal","Females","20 to 64 years",2019,7.0999999999999994E-2]
[null,"Portugal","Females","20 to 64 years",2020,7.0999999999999994E-2]
[null,"Portugal","Females","20 to 64 years",2021,6.9000000000000006E-2]
[null,"Portugal","Females","20 to 64 years",2022,6.4000000000000001E-2]
[null,"Portugal","Females","20 to 64 years",2023,6.7000000000000004E-2]
[null,"Portugal","Females","20 to 64 years",2024,6.7000000000000004E-2]
[null,"Romania","Females","20 to 64 years",2010,0.08]
[null,"Romania","Females","20 to 64 years",2011,8.199999999999999E-2]
[null,"Romania","Females","20 to 64 years",2012,7.8E-2]
[null,"Romania","Females","20 to 64 years",2013,0.08]
[null,"Romania","Females","20 to 64 years",2014,7.5999999999999998E-2]
[null,"Romania","Females","20 to 64 years",2015,6.9000000000000006E-2]
[null,"Romania","Females","20 to 64 years",2016,5.7999999999999996E-2]
[null,"Romania","Females","20 to 64 years",2017,4.7E-2]
[null,"Romania","Females","20 to 64 years",2018,4.2000000000000003E-2]
[null,"Romania","Females","20 to 64 years",2019,0.04]
[null,"Romania","Females","20 to 64 years",2020,5.4000000000000006E-2]
[null,"Romania","Females","20 to 64 years",2021,4.8000000000000001E-2]
[null,"Romania","Females","20 to 64 years",2022,4.7E-2]
[null,"Romania","Females","20 to 64 years",2023,4.9000000000000002E-2]
[null,"Romania","Females","20 to 64 years",2024,4.4999999999999998E-2]
[null,"Slovakia","Females","20 to 64 years",2010,0.14300000000000002]
[null,"Slovakia","Females","20 to 64 years",2011,0.13400000000000001]
[null,"Slovakia","Females","20 to 64 years",2012,0.14300000000000002]
[null,"Slovakia","Females","20 to 64 years",2013,0.14400000000000002]
[null,"Slovakia","Females","20 to 64 years",2014,0.13500000000000001]
[null,"Slovakia","Females","20 to 64 years",2015,0.128]
[null,"Slovakia","Females","20 to 64 years",2016,0.107]
[null,"Slovakia","Females","20 to 64 years",2017,8.3000000000000004E-2]
[null,"Slovakia","Females","20 to 64 years",2018,6.9000000000000006E-2]
[null,"Slovakia","Females","20 to 64 years",2019,5.7999999999999996E-2]
[null,"Slovakia","Females","20 to 64 years",2020,7.0000000000000007E-2]
[null,"Slovakia","Females","20 to 64 years",2021,6.9000000000000006E-2]
[null,"Slovakia","Females","20 to 64 years",2022,6.2E-2]
[null,"Slovakia","Females","20 to 64 years",2023,5.9000000000000004E-2]
[null,"Slovakia","Females","20 to 64 years",2024,5.7999999999999996E-2]
[null,"Slovenia","Females","20 to 64 years",2010,7.0999999999999994E-2]
[null,"Slovenia","Females","20 to 64 years",2011,8.199999999999999E-2]
[null,"Slovenia","Females","20 to 64 years",2012,9.5000000000000001E-2]
[null,"Slovenia","Females","20 to 64 years",2013,0.11]
[null,"Slovenia","Females","20 to 64 years",2014,0.107]
[null,"Slovenia","Females","20 to 64 years",2015,0.10199999999999999]
[null,"Slovenia","Females","20 to 64 years",2016,8.5999999999999993E-2]
[null,"Slovenia","Females","20 to 64 years",2017,7.400000000000001E-2]
[null,"Slovenia","Females","20 to 64 years",2018,5.7999999999999996E-2]
[null,"Slovenia","Females","20 to 64 years",2019,4.9000000000000002E-2]
[null,"Slovenia","Females","20 to 64 years",2020,5.5999999999999994E-2]
[null,"Slovenia","Females","20 to 64 years",2021,5.2000000000000005E-2]
[null,"Slovenia","Females","20 to 64 years",2022,4.0999999999999995E-2]
[null,"Slovenia","Females","20 to 64 years",2023,3.4000000000000002E-2]
[null,"Slovenia","Females","20 to 64 years",2024,3.7000000000000005E-2]
[null,"Spain","Females","20 to 64 years",2010,0.19699999999999998]
[null,"Spain","Females","20 to 64 years",2011,0.21299999999999999]
[null,"Spain","Females","20 to 64 years",2012,0.24600000000000002]
[null,"Spain","Females","20 to 64 years",2013,0.26200000000000001]
[null,"Spain","Females","20 to 64 years",2014,0.25]
[null,"Spain","Females","20 to 64 years",2015,0.23199999999999998]
[null,"Spain","Females","20 to 64 years",2016,0.21100000000000002]
[null,"Spain","Females","20 to 64 years",2017,0.188]
[null,"Spain","Females","20 to 64 years",2018,0.16800000000000001]
[null,"Spain","Females","20 to 64 years",2019,0.157]
[null,"Spain","Females","20 to 64 years",2020,0.17199999999999999]
[null,"Spain","Females","20 to 64 years",2021,0.16600000000000001]
[null,"Spain","Females","20 to 64 years",2022,0.14699999999999999]
[null,"Spain","Females","20 to 64 years",2023,0.13600000000000001]
[null,"Spain","Females","20 to 64 years",2024,0.12300000000000001]
[null,"Sweden","Females","20 to 64 years",2010,7.5999999999999998E-2]
[null,"Sweden","Females","20 to 64 years",2011,6.8000000000000005E-2]
[null,"Sweden","Females","20 to 64 years",2012,6.8000000000000005E-2]
[null,"Sweden","Females","20 to 64 years",2013,7.0000000000000007E-2]
[null,"Sweden","Females","20 to 64 years",2014,6.8000000000000005E-2]
[null,"Sweden","Females","20 to 64 years",2015,6.6000000000000003E-2]
[null,"Sweden","Females","20 to 64 years",2016,5.9000000000000004E-2]
[null,"Sweden","Females","20 to 64 years",2017,5.7999999999999996E-2]
[null,"Sweden","Females","20 to 64 years",2018,5.5999999999999994E-2]
[null,"Sweden","Females","20 to 64 years",2019,6.0999999999999999E-2]
[null,"Sweden","Females","20 to 64 years",2020,7.5999999999999998E-2]
[null,"Sweden","Females","20 to 64 years",2021,0.08]
[null,"Sweden","Females","20 to 64 years",2022,6.7000000000000004E-2]
[null,"Sweden","Females","20 to 64 years",2023,6.7000000000000004E-2]
[null,"Sweden","Females","20 to 64 years",2024,7.2000000000000008E-2]
[null,"Austria","Females","25 to 54 years",2010,4.4000000000000004E-2]
[null,"Austria","Females","25 to 54 years",2011,4.2999999999999997E-2]
[null,"Austria","Females","25 to 54 years",2012,4.4999999999999998E-2]
[null,"Austria","Females","25 to 54 years",2013,0.05]
[null,"Austria","Females","25 to 54 years",2014,5.2000000000000005E-2]
[null,"Austria","Females","25 to 54 years",2015,5.0999999999999997E-2]
[null,"Austria","Females","25 to 54 years",2016,5.4000000000000006E-2]
[null,"Austria","Females","25 to 54 years",2017,0.05]
[null,"Austria","Females","25 to 54 years",2018,4.2999999999999997E-2]
[null,"Austria","Females","25 to 54 years",2019,4.4000000000000004E-2]
[null,"Austria","Females","25 to 54 years",2020,5.5999999999999994E-2]
[null,"Austria","Females","25 to 54 years",2021,5.7999999999999996E-2]
[null,"Austria","Females","25 to 54 years",2022,4.2000000000000003E-2]
[null,"Austria","Females","25 to 54 years",2023,4.4000000000000004E-2]
[null,"Austria","Females","25 to 54 years",2024,4.4999999999999998E-2]
[null,"Belgium","Females","25 to 54 years",2010,7.4999999999999997E-2]
[null,"Belgium","Females","25 to 54 years",2011,6.4000000000000001E-2]
[null,"Belgium","Females","25 to 54 years",2012,6.7000000000000004E-2]
[null,"Belgium","Females","25 to 54 years",2013,7.2000000000000008E-2]
[null,"Belgium","Females","25 to 54 years",2014,7.0999999999999994E-2]
[null,"Belgium","Females","25 to 54 years",2015,7.2999999999999995E-2]
[null,"Belgium","Females","25 to 54 years",2016,6.9000000000000006E-2]
[null,"Belgium","Females","25 to 54 years",2017,6.3E-2]
[null,"Belgium","Females","25 to 54 years",2018,5.0999999999999997E-2]
[null,"Belgium","Females","25 to 54 years",2019,4.4999999999999998E-2]
[null,"Belgium","Females","25 to 54 years",2020,0.05]
[null,"Belgium","Females","25 to 54 years",2021,5.2000000000000005E-2]
[null,"Belgium","Females","25 to 54 years",2022,4.7E-2]
[null,"Belgium","Females","25 to 54 years",2023,4.4999999999999998E-2]
[null,"Belgium","Females","25 to 54 years",2024,4.8000000000000001E-2]
[null,"Bulgaria","Females","25 to 54 years",2010,9.8000000000000004E-2]
[null,"Bulgaria","Females","25 to 54 years",2011,0.10300000000000001]
[null,"Bulgaria","Females","25 to 54 years",2012,0.109]
[null,"Bulgaria","Females","25 to 54 years",2013,0.11900000000000001]
[null,"Bulgaria","Females","25 to 54 years",2014,0.105]
[null,"Bulgaria","Females","25 to 54 years",2015,8.6999999999999994E-2]
[null,"Bulgaria","Females","25 to 54 years",2016,7.4999999999999997E-2]
[null,"Bulgaria","Females","25 to 54 years",2017,6.8000000000000005E-2]
[null,"Bulgaria","Females","25 to 54 years",2018,5.5999999999999994E-2]
[null,"Bulgaria","Females","25 to 54 years",2019,4.7E-2]
[null,"Bulgaria","Females","25 to 54 years",2020,5.5999999999999994E-2]
[null,"Bulgaria","Females","25 to 54 years",2021,4.9000000000000002E-2]
[null,"Bulgaria","Females","25 to 54 years",2022,0.04]
[null,"Bulgaria","Females","25 to 54 years",2023,4.2000000000000003E-2]
[null,"Bulgaria","Females","25 to 54 years",2024,3.7999999999999999E-2]
[null,"Croatia","Females","25 to 54 years",2010,0.11199999999999999]
[null,"Croatia","Females","25 to 54 years",2011,0.129]
[null,"Croatia","Females","25 to 54 years",2012,0.14800000000000002]
[null,"Croatia","Females","25 to 54 years",2013,0.155]
[null,"Croatia","Females","25 to 54 years",2014,0.16699999999999998]
[null,"Croatia","Females","25 to 54 years",2015,0.157]
[null,"Croatia","Females","25 to 54 years",2016,0.13]
[null,"Croatia","Females","25 to 54 years",2017,0.109]
[null,"Croatia","Females","25 to 54 years",2018,8.4000000000000005E-2]
[null,"Croatia","Females","25 to 54 years",2019,6.6000000000000003E-2]
[null,"Croatia","Females","25 to 54 years",2020,6.6000000000000003E-2]
[null,"Croatia","Females","25 to 54 years",2021,7.0999999999999994E-2]
[null,"Croatia","Females","25 to 54 years",2022,7.2999999999999995E-2]
[null,"Croatia","Females","25 to 54 years",2023,0.06]
[null,"Croatia","Females","25 to 54 years",2024,4.2000000000000003E-2]
[null,"Cyprus","Females","25 to 54 years",2010,5.2999999999999999E-2]
[null,"Cyprus","Females","25 to 54 years",2011,6.4000000000000001E-2]
[null,"Cyprus","Females","25 to 54 years",2012,9.8000000000000004E-2]
[null,"Cyprus","Females","25 to 54 years",2013,0.13400000000000001]
[null,"Cyprus","Females","25 to 54 years",2014,0.129]
[null,"Cyprus","Females","25 to 54 years",2015,0.13200000000000001]
[null,"Cyprus","Females","25 to 54 years",2016,0.12]
[null,"Cyprus","Females","25 to 54 years",2017,0.109]
[null,"Cyprus","Females","25 to 54 years",2018,8.5999999999999993E-2]
[null,"Cyprus","Females","25 to 54 years",2019,7.400000000000001E-2]
[null,"Cyprus","Females","25 to 54 years",2020,7.4999999999999997E-2]
[null,"Cyprus","Females","25 to 54 years",2021,6.9000000000000006E-2]
[null,"Cyprus","Females","25 to 54 years",2022,6.4000000000000001E-2]
[null,"Cyprus","Females","25 to 54 years",2023,5.5999999999999994E-2]
[null,"Cyprus","Females","25 to 54 years",2024,4.9000000000000002E-2]
[null,"Czechia","Females","25 to 54 years",2010,0.08]
[null,"Czechia","Females","25 to 54 years",2011,7.5999999999999998E-2]
[null,"Czechia","Females","25 to 54 years",2012,7.8E-2]
[null,"Czechia","Females","25 to 54 years",2013,7.9000000000000001E-2]
[null,"Czechia","Females","25 to 54 years",2014,7.0999999999999994E-2]
[null,"Czechia","Females","25 to 54 years",2015,5.7999999999999996E-2]
[null,"Czechia","Females","25 to 54 years",2016,4.4999999999999998E-2]
[null,"Czechia","Females","25 to 54 years",2017,3.4000000000000002E-2]
[null,"Czechia","Females","25 to 54 years",2018,2.7000000000000003E-2]
[null,"Czechia","Females","25 to 54 years",2019,2.3E-2]
[null,"Czechia","Females","25 to 54 years",2020,2.7999999999999997E-2]
[null,"Czechia","Females","25 to 54 years",2021,3.3000000000000002E-2]
[null,"Czechia","Females","25 to 54 years",2022,2.6000000000000002E-2]
[null,"Czechia","Females","25 to 54 years",2023,2.8999999999999998E-2]
[null,"Czechia","Females","25 to 54 years",2024,2.7999999999999997E-2]
[null,"Denmark","Females","25 to 54 years",2010,0.06]
[null,"Denmark","Females","25 to 54 years",2011,6.9000000000000006E-2]
[null,"Denmark","Females","25 to 54 years",2012,6.8000000000000005E-2]
[null,"Denmark","Females","25 to 54 years",2013,7.0999999999999994E-2]
[null,"Denmark","Females","25 to 54 years",2014,6.6000000000000003E-2]
[null,"Denmark","Females","25 to 54 years",2015,0.06]
[null,"Denmark","Females","25 to 54 years",2016,6.0999999999999999E-2]
[null,"Denmark","Females","25 to 54 years",2017,5.5E-2]
[null,"Denmark","Females","25 to 54 years",2018,4.9000000000000002E-2]
[null,"Denmark","Females","25 to 54 years",2019,4.8000000000000001E-2]
[null,"Denmark","Females","25 to 54 years",2020,5.5E-2]
[null,"Denmark","Females","25 to 54 years",2021,4.2999999999999997E-2]
[null,"Denmark","Females","25 to 54 years",2022,3.7000000000000005E-2]
[null,"Denmark","Females","25 to 54 years",2023,4.5999999999999999E-2]
[null,"Denmark","Females","25 to 54 years",2024,5.5E-2]
[null,"Estonia","Females","25 to 54 years",2010,0.125]
[null,"Estonia","Females","25 to 54 years",2011,0.113]
[null,"Estonia","Females","25 to 54 years",2012,8.900000000000001E-2]
[null,"Estonia","Females","25 to 54 years",2013,0.08]
[null,"Estonia","Females","25 to 54 years",2014,7.0000000000000007E-2]
[null,"Estonia","Females","25 to 54 years",2015,5.7999999999999996E-2]
[null,"Estonia","Females","25 to 54 years",2016,5.5999999999999994E-2]
[null,"Estonia","Females","25 to 54 years",2017,5.2000000000000005E-2]
[null,"Estonia","Females","25 to 54 years",2018,0.05]
[null,"Estonia","Females","25 to 54 years",2019,4.8000000000000001E-2]
[null,"Estonia","Females","25 to 54 years",2020,0.06]
[null,"Estonia","Females","25 to 54 years",2021,0.05]
[null,"Estonia","Females","25 to 54 years",2022,4.2999999999999997E-2]
[null,"Estonia","Females","25 to 54 years",2023,0.06]
[null,"Estonia","Females","25 to 54 years",2024,7.0999999999999994E-2]
[null,"Finland","Females","25 to 54 years",2010,6.2E-2]
[null,"Finland","Females","25 to 54 years",2011,5.7000000000000002E-2]
[null,"Finland","Females","25 to 54 years",2012,5.5999999999999994E-2]
[null,"Finland","Females","25 to 54 years",2013,6.3E-2]
[null,"Finland","Females","25 to 54 years",2014,6.5000000000000002E-2]
[null,"Finland","Females","25 to 54 years",2015,7.2999999999999995E-2]
[null,"Finland","Females","25 to 54 years",2016,7.2000000000000008E-2]
[null,"Finland","Females","25 to 54 years",2017,6.8000000000000005E-2]
[null,"Finland","Females","25 to 54 years",2018,5.9000000000000004E-2]
[null,"Finland","Females","25 to 54 years",2019,4.9000000000000002E-2]
[null,"Finland","Females","25 to 54 years",2020,5.7000000000000002E-2]
[null,"Finland","Females","25 to 54 years",2021,5.5999999999999994E-2]
[null,"Finland","Females","25 to 54 years",2022,5.4000000000000006E-2]
[null,"Finland","Females","25 to 54 years",2023,5.0999999999999997E-2]
[null,"Finland","Females","25 to 54 years",2024,6.3E-2]
[null,"France","Females","25 to 54 years",2010,7.9000000000000001E-2]
[null,"France","Females","25 to 54 years",2011,0.08]
[null,"France","Females","25 to 54 years",2012,8.3000000000000004E-2]
[null,"France","Females","25 to 54 years",2013,8.6999999999999994E-2]
[null,"France","Females","25 to 54 years",2014,8.6999999999999994E-2]
[null,"France","Females","25 to 54 years",2015,8.5000000000000006E-2]
[null,"France","Females","25 to 54 years",2016,8.5000000000000006E-2]
[null,"France","Females","25 to 54 years",2017,8.4000000000000005E-2]
[null,"France","Females","25 to 54 years",2018,0.08]
[null,"France","Females","25 to 54 years",2019,7.2000000000000008E-2]
[null,"France","Females","25 to 54 years",2020,6.7000000000000004E-2]
[null,"France","Females","25 to 54 years",2021,6.7000000000000004E-2]
[null,"France","Females","25 to 54 years",2022,6.3E-2]
[null,"France","Females","25 to 54 years",2023,6.5000000000000002E-2]
[null,"France","Females","25 to 54 years",2024,6.3E-2]
[null,"Germany","Females","25 to 54 years",2010,5.5999999999999994E-2]
[null,"Germany","Females","25 to 54 years",2011,4.8000000000000001E-2]
[null,"Germany","Females","25 to 54 years",2012,4.4999999999999998E-2]
[null,"Germany","Females","25 to 54 years",2013,4.2000000000000003E-2]
[null,"Germany","Females","25 to 54 years",2014,0.04]
[null,"Germany","Females","25 to 54 years",2015,3.7000000000000005E-2]
[null,"Germany","Females","25 to 54 years",2016,3.2000000000000001E-2]
[null,"Germany","Females","25 to 54 years",2017,2.7999999999999997E-2]
[null,"Germany","Females","25 to 54 years",2018,2.5000000000000001E-2]
[null,"Germany","Females","25 to 54 years",2019,2.4E-2]
[null,"Germany","Females","25 to 54 years",2020,2.8999999999999998E-2]
[null,"Germany","Females","25 to 54 years",2021,2.8999999999999998E-2]
[null,"Germany","Females","25 to 54 years",2022,2.7000000000000003E-2]
[null,"Germany","Females","25 to 54 years",2023,2.7999999999999997E-2]
[null,"Germany","Females","25 to 54 years",2024,3.1E-2]
[null,"Greece","Females","25 to 54 years",2010,0.158]
[null,"Greece","Females","25 to 54 years",2011,0.20899999999999999]
[null,"Greece","Females","25 to 54 years",2012,0.27500000000000002]
[null,"Greece","Females","25 to 54 years",2013,0.312]
[null,"Greece","Females","25 to 54 years",2014,0.3]
[null,"Greece","Females","25 to 54 years",2015,0.28800000000000003]
[null,"Greece","Females","25 to 54 years",2016,0.28499999999999998]
[null,"Greece","Females","25 to 54 years",2017,0.26]
[null,"Greece","Females","25 to 54 years",2018,0.24600000000000002]
[null,"Greece","Females","25 to 54 years",2019,0.22600000000000001]
[null,"Greece","Females","25 to 54 years",2020,0.217]
[null,"Greece","Females","25 to 54 years",2021,0.188]
[null,"Greece","Females","25 to 54 years",2022,0.161]
[null,"Greece","Females","25 to 54 years",2023,0.14499999999999999]
[null,"Greece","Females","25 to 54 years",2024,0.128]
[null,"Hungary","Females","25 to 54 years",2010,9.3000000000000013E-2]
[null,"Hungary","Females","25 to 54 years",2011,9.6000000000000002E-2]
[null,"Hungary","Females","25 to 54 years",2012,0.09]
[null,"Hungary","Females","25 to 54 years",2013,8.4000000000000005E-2]
[null,"Hungary","Females","25 to 54 years",2014,6.6000000000000003E-2]
[null,"Hungary","Females","25 to 54 years",2015,6.0999999999999999E-2]
[null,"Hungary","Females","25 to 54 years",2016,4.2000000000000003E-2]
[null,"Hungary","Females","25 to 54 years",2017,3.7000000000000005E-2]
[null,"Hungary","Females","25 to 54 years",2018,3.4000000000000002E-2]
[null,"Hungary","Females","25 to 54 years",2019,0.03]
[null,"Hungary","Females","25 to 54 years",2020,3.7999999999999999E-2]
[null,"Hungary","Females","25 to 54 years",2021,3.7000000000000005E-2]
[null,"Hungary","Females","25 to 54 years",2022,3.2000000000000001E-2]
[null,"Hungary","Females","25 to 54 years",2023,3.7999999999999999E-2]
[null,"Hungary","Females","25 to 54 years",2024,3.7000000000000005E-2]
[null,"Ireland","Females","25 to 54 years",2010,0.10199999999999999]
[null,"Ireland","Females","25 to 54 years",2011,0.11599999999999999]
[null,"Ireland","Females","25 to 54 years",2012,0.11699999999999999]
[null,"Ireland","Females","25 to 54 years",2013,0.11199999999999999]
[null,"Ireland","Females","25 to 54 years",2014,9.9000000000000005E-2]
[null,"Ireland","Females","25 to 54 years",2015,8.1000000000000003E-2]
[null,"Ireland","Females","25 to 54 years",2016,7.0000000000000007E-2]
[null,"Ireland","Females","25 to 54 years",2017,5.4000000000000006E-2]
[null,"Ireland","Females","25 to 54 years",2018,4.9000000000000002E-2]
[null,"Ireland","Females","25 to 54 years",2019,0.04]
[null,"Ireland","Females","25 to 54 years",2020,4.7E-2]
[null,"Ireland","Females","25 to 54 years",2021,4.8000000000000001E-2]
[null,"Ireland","Females","25 to 54 years",2022,3.9E-2]
[null,"Ireland","Females","25 to 54 years",2023,3.3000000000000002E-2]
[null,"Ireland","Females","25 to 54 years",2024,3.5000000000000003E-2]
[null,"Italy","Females","25 to 54 years",2010,0.09]
[null,"Italy","Females","25 to 54 years",2011,8.900000000000001E-2]
[null,"Italy","Females","25 to 54 years",2012,0.111]
[null,"Italy","Females","25 to 54 years",2013,0.125]
[null,"Italy","Females","25 to 54 years",2014,0.13200000000000001]
[null,"Italy","Females","25 to 54 years",2015,0.122]
[null,"Italy","Females","25 to 54 years",2016,0.125]
[null,"Italy","Females","25 to 54 years",2017,0.12300000000000001]
[null,"Italy","Females","25 to 54 years",2018,0.11800000000000001]
[null,"Italy","Females","25 to 54 years",2019,0.113]
[null,"Italy","Females","25 to 54 years",2020,0.105]
[null,"Italy","Females","25 to 54 years",2021,0.106]
[null,"Italy","Females","25 to 54 years",2022,9.5000000000000001E-2]
[null,"Italy","Females","25 to 54 years",2023,8.8000000000000009E-2]
[null,"Italy","Females","25 to 54 years",2024,7.4999999999999997E-2]
[null,"Latvia","Females","25 to 54 years",2010,0.15]
[null,"Latvia","Females","25 to 54 years",2011,0.124]
[null,"Latvia","Females","25 to 54 years",2012,0.126]
[null,"Latvia","Females","25 to 54 years",2013,0.10300000000000001]
[null,"Latvia","Females","25 to 54 years",2014,9.5000000000000001E-2]
[null,"Latvia","Females","25 to 54 years",2015,8.5999999999999993E-2]
[null,"Latvia","Females","25 to 54 years",2016,8.8000000000000009E-2]
[null,"Latvia","Females","25 to 54 years",2017,7.4999999999999997E-2]
[null,"Latvia","Females","25 to 54 years",2018,6.2E-2]
[null,"Latvia","Females","25 to 54 years",2019,5.2000000000000005E-2]
[null,"Latvia","Females","25 to 54 years",2020,6.9000000000000006E-2]
[null,"Latvia","Females","25 to 54 years",2021,6.6000000000000003E-2]
[null,"Latvia","Females","25 to 54 years",2022,5.7999999999999996E-2]
[null,"Latvia","Females","25 to 54 years",2023,5.4000000000000006E-2]
[null,"Latvia","Females","25 to 54 years",2024,5.7000000000000002E-2]
[null,"Lithuania","Females","25 to 54 years",2010,0.13500000000000001]
[null,"Lithuania","Females","25 to 54 years",2011,0.121]
[null,"Lithuania","Females","25 to 54 years",2012,0.111]
[null,"Lithuania","Females","25 to 54 years",2013,0.10099999999999999]
[null,"Lithuania","Females","25 to 54 years",2014,8.8000000000000009E-2]
[null,"Lithuania","Females","25 to 54 years",2015,7.8E-2]
[null,"Lithuania","Females","25 to 54 years",2016,6.4000000000000001E-2]
[null,"Lithuania","Females","25 to 54 years",2017,5.0999999999999997E-2]
[null,"Lithuania","Females","25 to 54 years",2018,4.7E-2]
[null,"Lithuania","Females","25 to 54 years",2019,0.05]
[null,"Lithuania","Females","25 to 54 years",2020,6.7000000000000004E-2]
[null,"Lithuania","Females","25 to 54 years",2021,5.9000000000000004E-2]
[null,"Lithuania","Females","25 to 54 years",2022,0.05]
[null,"Lithuania","Females","25 to 54 years",2023,6.2E-2]
[null,"Lithuania","Females","25 to 54 years",2024,5.7000000000000002E-2]
[null,"Luxembourg","Females","25 to 54 years",2010,0.05]
[null,"Luxembourg","Females","25 to 54 years",2011,5.5E-2]
[null,"Luxembourg","Females","25 to 54 years",2012,5.2999999999999999E-2]
[null,"Luxembourg","Females","25 to 54 years",2013,6.2E-2]
[null,"Luxembourg","Females","25 to 54 years",2014,5.0999999999999997E-2]
[null,"Luxembourg","Females","25 to 54 years",2015,6.9000000000000006E-2]
[null,"Luxembourg","Females","25 to 54 years",2016,5.7999999999999996E-2]
[null,"Luxembourg","Females","25 to 54 years",2017,0.05]
[null,"Luxembourg","Females","25 to 54 years",2018,5.5999999999999994E-2]
[null,"Luxembourg","Females","25 to 54 years",2019,4.8000000000000001E-2]
[null,"Luxembourg","Females","25 to 54 years",2020,6.2E-2]
[null,"Luxembourg","Females","25 to 54 years",2021,0.05]
[null,"Luxembourg","Females","25 to 54 years",2022,3.4000000000000002E-2]
[null,"Luxembourg","Females","25 to 54 years",2023,4.2000000000000003E-2]
[null,"Luxembourg","Females","25 to 54 years",2024,5.5999999999999994E-2]
[null,"Malta","Females","25 to 54 years",2010,6.0999999999999999E-2]
[null,"Malta","Females","25 to 54 years",2011,5.9000000000000004E-2]
[null,"Malta","Females","25 to 54 years",2012,5.4000000000000006E-2]
[null,"Malta","Females","25 to 54 years",2013,5.2000000000000005E-2]
[null,"Malta","Females","25 to 54 years",2014,4.2999999999999997E-2]
[null,"Malta","Females","25 to 54 years",2015,4.7E-2]
[null,"Malta","Females","25 to 54 years",2016,4.2000000000000003E-2]
[null,"Malta","Females","25 to 54 years",2017,3.4000000000000002E-2]
[null,"Malta","Females","25 to 54 years",2018,3.1E-2]
[null,"Malta","Females","25 to 54 years",2019,4.4000000000000004E-2]
[null,"Malta","Females","25 to 54 years",2020,4.8000000000000001E-2]
[null,"Malta","Females","25 to 54 years",2021,0.03]
[null,"Malta","Females","25 to 54 years",2022,0.03]
[null,"Malta","Females","25 to 54 years",2023,3.1E-2]
[null,"Malta","Females","25 to 54 years",2024,2.5000000000000001E-2]
[null,"Netherlands","Females","25 to 54 years",2010,5.7999999999999996E-2]
[null,"Netherlands","Females","25 to 54 years",2011,5.5999999999999994E-2]
[null,"Netherlands","Females","25 to 54 years",2012,6.2E-2]
[null,"Netherlands","Females","25 to 54 years",2013,7.2999999999999995E-2]
[null,"Netherlands","Females","25 to 54 years",2014,7.6999999999999999E-2]
[null,"Netherlands","Females","25 to 54 years",2015,7.400000000000001E-2]
[null,"Netherlands","Females","25 to 54 years",2016,6.5000000000000002E-2]
[null,"Netherlands","Females","25 to 54 years",2017,5.2999999999999999E-2]
[null,"Netherlands","Females","25 to 54 years",2018,4.2000000000000003E-2]
[null,"Netherlands","Females","25 to 54 years",2019,3.7999999999999999E-2]
[null,"Netherlands","Females","25 to 54 years",2020,4.0999999999999995E-2]
[null,"Netherlands","Females","25 to 54 years",2021,3.5000000000000003E-2]
[null,"Netherlands","Females","25 to 54 years",2022,2.7000000000000003E-2]
[null,"Netherlands","Females","25 to 54 years",2023,2.7000000000000003E-2]
[null,"Netherlands","Females","25 to 54 years",2024,2.8999999999999998E-2]
[null,"Poland","Females","25 to 54 years",2010,8.900000000000001E-2]
[null,"Poland","Females","25 to 54 years",2011,9.3000000000000013E-2]
[null,"Poland","Females","25 to 54 years",2012,9.8000000000000004E-2]
[null,"Poland","Females","25 to 54 years",2013,0.10199999999999999]
[null,"Poland","Females","25 to 54 years",2014,8.8000000000000009E-2]
[null,"Poland","Females","25 to 54 years",2015,7.2000000000000008E-2]
[null,"Poland","Females","25 to 54 years",2016,5.7000000000000002E-2]
[null,"Poland","Females","25 to 54 years",2017,4.4000000000000004E-2]
[null,"Poland","Females","25 to 54 years",2018,3.5000000000000003E-2]
[null,"Poland","Females","25 to 54 years",2019,3.3000000000000002E-2]
[null,"Poland","Females","25 to 54 years",2020,0.03]
[null,"Poland","Females","25 to 54 years",2021,0.03]
[null,"Poland","Females","25 to 54 years",2022,2.6000000000000002E-2]
[null,"Poland","Females","25 to 54 years",2023,2.5000000000000001E-2]
[null,"Poland","Females","25 to 54 years",2024,2.7999999999999997E-2]
[null,"Portugal","Females","25 to 54 years",2010,0.12]
[null,"Portugal","Females","25 to 54 years",2011,0.126]
[null,"Portugal","Females","25 to 54 years",2012,0.14899999999999999]
[null,"Portugal","Females","25 to 54 years",2013,0.159]
[null,"Portugal","Females","25 to 54 years",2014,0.13500000000000001]
[null,"Portugal","Females","25 to 54 years",2015,0.11599999999999999]
[null,"Portugal","Females","25 to 54 years",2016,0.10400000000000001]
[null,"Portugal","Females","25 to 54 years",2017,8.5000000000000006E-2]
[null,"Portugal","Females","25 to 54 years",2018,6.7000000000000004E-2]
[null,"Portugal","Females","25 to 54 years",2019,6.2E-2]
[null,"Portugal","Females","25 to 54 years",2020,6.5000000000000002E-2]
[null,"Portugal","Females","25 to 54 years",2021,6.0999999999999999E-2]
[null,"Portugal","Females","25 to 54 years",2022,5.7999999999999996E-2]
[null,"Portugal","Females","25 to 54 years",2023,6.0999999999999999E-2]
[null,"Portugal","Females","25 to 54 years",2024,5.9000000000000004E-2]
[null,"Romania","Females","25 to 54 years",2010,7.0000000000000007E-2]
[null,"Romania","Females","25 to 54 years",2011,7.2999999999999995E-2]
[null,"Romania","Females","25 to 54 years",2012,6.8000000000000005E-2]
[null,"Romania","Females","25 to 54 years",2013,6.9000000000000006E-2]
[null,"Romania","Females","25 to 54 years",2014,6.7000000000000004E-2]
[null,"Romania","Females","25 to 54 years",2015,6.0999999999999999E-2]
[null,"Romania","Females","25 to 54 years",2016,5.0999999999999997E-2]
[null,"Romania","Females","25 to 54 years",2017,0.04]
[null,"Romania","Females","25 to 54 years",2018,3.5000000000000003E-2]
[null,"Romania","Females","25 to 54 years",2019,3.2000000000000001E-2]
[null,"Romania","Females","25 to 54 years",2020,4.8000000000000001E-2]
[null,"Romania","Females","25 to 54 years",2021,4.2000000000000003E-2]
[null,"Romania","Females","25 to 54 years",2022,4.0999999999999995E-2]
[null,"Romania","Females","25 to 54 years",2023,4.2999999999999997E-2]
[null,"Romania","Females","25 to 54 years",2024,4.0999999999999995E-2]
[null,"Slovakia","Females","25 to 54 years",2010,0.13500000000000001]
[null,"Slovakia","Females","25 to 54 years",2011,0.127]
[null,"Slovakia","Females","25 to 54 years",2012,0.13600000000000001]
[null,"Slovakia","Females","25 to 54 years",2013,0.13699999999999998]
[null,"Slovakia","Females","25 to 54 years",2014,0.128]
[null,"Slovakia","Females","25 to 54 years",2015,0.12300000000000001]
[null,"Slovakia","Females","25 to 54 years",2016,9.9000000000000005E-2]
[null,"Slovakia","Females","25 to 54 years",2017,0.08]
[null,"Slovakia","Females","25 to 54 years",2018,6.7000000000000004E-2]
[null,"Slovakia","Females","25 to 54 years",2019,5.4000000000000006E-2]
[null,"Slovakia","Females","25 to 54 years",2020,6.8000000000000005E-2]
[null,"Slovakia","Females","25 to 54 years",2021,6.6000000000000003E-2]
[null,"Slovakia","Females","25 to 54 years",2022,6.0999999999999999E-2]
[null,"Slovakia","Females","25 to 54 years",2023,5.9000000000000004E-2]
[null,"Slovakia","Females","25 to 54 years",2024,5.9000000000000004E-2]
[null,"Slovenia","Females","25 to 54 years",2010,6.8000000000000005E-2]
[null,"Slovenia","Females","25 to 54 years",2011,7.9000000000000001E-2]
[null,"Slovenia","Females","25 to 54 years",2012,0.09]
[null,"Slovenia","Females","25 to 54 years",2013,0.105]
[null,"Slovenia","Females","25 to 54 years",2014,0.105]
[null,"Slovenia","Females","25 to 54 years",2015,0.10199999999999999]
[null,"Slovenia","Females","25 to 54 years",2016,8.6999999999999994E-2]
[null,"Slovenia","Females","25 to 54 years",2017,7.400000000000001E-2]
[null,"Slovenia","Females","25 to 54 years",2018,5.7000000000000002E-2]
[null,"Slovenia","Females","25 to 54 years",2019,4.8000000000000001E-2]
[null,"Slovenia","Females","25 to 54 years",2020,5.2999999999999999E-2]
[null,"Slovenia","Females","25 to 54 years",2021,4.9000000000000002E-2]
[null,"Slovenia","Females","25 to 54 years",2022,3.7999999999999999E-2]
[null,"Slovenia","Females","25 to 54 years",2023,3.2000000000000001E-2]
[null,"Slovenia","Females","25 to 54 years",2024,3.6000000000000004E-2]
[null,"Spain","Females","25 to 54 years",2010,0.18899999999999997]
[null,"Spain","Females","25 to 54 years",2011,0.20499999999999999]
[null,"Spain","Females","25 to 54 years",2012,0.23600000000000002]
[null,"Spain","Females","25 to 54 years",2013,0.252]
[null,"Spain","Females","25 to 54 years",2014,0.24100000000000002]
[null,"Spain","Females","25 to 54 years",2015,0.22399999999999998]
[null,"Spain","Females","25 to 54 years",2016,0.20300000000000001]
[null,"Spain","Females","25 to 54 years",2017,0.182]
[null,"Spain","Females","25 to 54 years",2018,0.16200000000000001]
[null,"Spain","Females","25 to 54 years",2019,0.15]
[null,"Spain","Females","25 to 54 years",2020,0.16600000000000001]
[null,"Spain","Females","25 to 54 years",2021,0.157]
[null,"Spain","Females","25 to 54 years",2022,0.13900000000000001]
[null,"Spain","Females","25 to 54 years",2023,0.128]
[null,"Spain","Females","25 to 54 years",2024,0.115]
[null,"Sweden","Females","25 to 54 years",2010,6.9000000000000006E-2]
[null,"Sweden","Females","25 to 54 years",2011,6.0999999999999999E-2]
[null,"Sweden","Females","25 to 54 years",2012,0.06]
[null,"Sweden","Females","25 to 54 years",2013,6.4000000000000001E-2]
[null,"Sweden","Females","25 to 54 years",2014,6.2E-2]
[null,"Sweden","Females","25 to 54 years",2015,6.0999999999999999E-2]
[null,"Sweden","Females","25 to 54 years",2016,5.5999999999999994E-2]
[null,"Sweden","Females","25 to 54 years",2017,5.5E-2]
[null,"Sweden","Females","25 to 54 years",2018,5.5E-2]
[null,"Sweden","Females","25 to 54 years",2019,5.9000000000000004E-2]
[null,"Sweden","Females","25 to 54 years",2020,7.4999999999999997E-2]
[null,"Sweden","Females","25 to 54 years",2021,7.6999999999999999E-2]
[null,"Sweden","Females","25 to 54 years",2022,6.0999999999999999E-2]
[null,"Sweden","Females","25 to 54 years",2023,6.4000000000000001E-2]
[null,"Sweden","Females","25 to 54 years",2024,6.8000000000000005E-2]
[null,"Austria","Females","25 to 74 years",2010,4.0999999999999995E-2]
[null,"Austria","Females","25 to 74 years",2011,4.0999999999999995E-2]
[null,"Austria","Females","25 to 74 years",2012,4.2999999999999997E-2]
[null,"Austria","Females","25 to 74 years",2013,4.8000000000000001E-2]
[null,"Austria","Females","25 to 74 years",2014,4.9000000000000002E-2]
[null,"Austria","Females","25 to 74 years",2015,4.9000000000000002E-2]
[null,"Austria","Females","25 to 74 years",2016,5.0999999999999997E-2]
[null,"Austria","Females","25 to 74 years",2017,4.8000000000000001E-2]
[null,"Austria","Females","25 to 74 years",2018,4.2000000000000003E-2]
[null,"Austria","Females","25 to 74 years",2019,4.0999999999999995E-2]
[null,"Austria","Females","25 to 74 years",2020,5.2999999999999999E-2]
[null,"Austria","Females","25 to 74 years",2021,5.5E-2]
[null,"Austria","Females","25 to 74 years",2022,3.9E-2]
[null,"Austria","Females","25 to 74 years",2023,4.0999999999999995E-2]
[null,"Austria","Females","25 to 74 years",2024,4.0999999999999995E-2]
[null,"Belgium","Females","25 to 74 years",2010,7.2999999999999995E-2]
[null,"Belgium","Females","25 to 74 years",2011,6.0999999999999999E-2]
[null,"Belgium","Females","25 to 74 years",2012,6.5000000000000002E-2]
[null,"Belgium","Females","25 to 74 years",2013,7.0000000000000007E-2]
[null,"Belgium","Females","25 to 74 years",2014,6.8000000000000005E-2]
[null,"Belgium","Females","25 to 74 years",2015,6.9000000000000006E-2]
[null,"Belgium","Females","25 to 74 years",2016,6.8000000000000005E-2]
[null,"Belgium","Females","25 to 74 years",2017,6.3E-2]
[null,"Belgium","Females","25 to 74 years",2018,4.8000000000000001E-2]
[null,"Belgium","Females","25 to 74 years",2019,4.4000000000000004E-2]
[null,"Belgium","Females","25 to 74 years",2020,4.7E-2]
[null,"Belgium","Females","25 to 74 years",2021,0.05]
[null,"Belgium","Females","25 to 74 years",2022,4.4999999999999998E-2]
[null,"Belgium","Females","25 to 74 years",2023,4.2000000000000003E-2]
[null,"Belgium","Females","25 to 74 years",2024,4.4000000000000004E-2]
[null,"Bulgaria","Females","25 to 74 years",2010,9.6000000000000002E-2]
[null,"Bulgaria","Females","25 to 74 years",2011,0.1]
[null,"Bulgaria","Females","25 to 74 years",2012,0.106]
[null,"Bulgaria","Females","25 to 74 years",2013,0.11800000000000001]
[null,"Bulgaria","Females","25 to 74 years",2014,0.105]
[null,"Bulgaria","Females","25 to 74 years",2015,8.5999999999999993E-2]
[null,"Bulgaria","Females","25 to 74 years",2016,7.400000000000001E-2]
[null,"Bulgaria","Females","25 to 74 years",2017,6.5000000000000002E-2]
[null,"Bulgaria","Females","25 to 74 years",2018,5.2000000000000005E-2]
[null,"Bulgaria","Females","25 to 74 years",2019,4.4999999999999998E-2]
[null,"Bulgaria","Females","25 to 74 years",2020,5.2999999999999999E-2]
[null,"Bulgaria","Females","25 to 74 years",2021,4.5999999999999999E-2]
[null,"Bulgaria","Females","25 to 74 years",2022,3.7000000000000005E-2]
[null,"Bulgaria","Females","25 to 74 years",2023,0.04]
[null,"Bulgaria","Females","25 to 74 years",2024,3.7000000000000005E-2]
[null,"Croatia","Females","25 to 74 years",2010,0.10300000000000001]
[null,"Croatia","Females","25 to 74 years",2011,0.11900000000000001]
[null,"Croatia","Females","25 to 74 years",2012,0.14000000000000001]
[null,"Croatia","Females","25 to 74 years",2013,0.14199999999999999]
[null,"Croatia","Females","25 to 74 years",2014,0.16]
[null,"Croatia","Females","25 to 74 years",2015,0.14899999999999999]
[null,"Croatia","Females","25 to 74 years",2016,0.121]
[null,"Croatia","Females","25 to 74 years",2017,0.10400000000000001]
[null,"Croatia","Females","25 to 74 years",2018,7.6999999999999999E-2]
[null,"Croatia","Females","25 to 74 years",2019,6.2E-2]
[null,"Croatia","Females","25 to 74 years",2020,6.4000000000000001E-2]
[null,"Croatia","Females","25 to 74 years",2021,6.7000000000000004E-2]
[null,"Croatia","Females","25 to 74 years",2022,6.8000000000000005E-2]
[null,"Croatia","Females","25 to 74 years",2023,5.7000000000000002E-2]
[null,"Croatia","Females","25 to 74 years",2024,4.2000000000000003E-2]
[null,"Cyprus","Females","25 to 74 years",2010,5.0999999999999997E-2]
[null,"Cyprus","Females","25 to 74 years",2011,6.0999999999999999E-2]
[null,"Cyprus","Females","25 to 74 years",2012,9.4E-2]
[null,"Cyprus","Females","25 to 74 years",2013,0.128]
[null,"Cyprus","Females","25 to 74 years",2014,0.128]
[null,"Cyprus","Females","25 to 74 years",2015,0.13]
[null,"Cyprus","Females","25 to 74 years",2016,0.114]
[null,"Cyprus","Females","25 to 74 years",2017,0.1]
[null,"Cyprus","Females","25 to 74 years",2018,7.9000000000000001E-2]
[null,"Cyprus","Females","25 to 74 years",2019,7.0999999999999994E-2]
[null,"Cyprus","Females","25 to 74 years",2020,7.2000000000000008E-2]
[null,"Cyprus","Females","25 to 74 years",2021,6.7000000000000004E-2]
[null,"Cyprus","Females","25 to 74 years",2022,0.06]
[null,"Cyprus","Females","25 to 74 years",2023,5.2999999999999999E-2]
[null,"Cyprus","Females","25 to 74 years",2024,4.5999999999999999E-2]
[null,"Czechia","Females","25 to 74 years",2010,7.6999999999999999E-2]
[null,"Czechia","Females","25 to 74 years",2011,7.2000000000000008E-2]
[null,"Czechia","Females","25 to 74 years",2012,7.4999999999999997E-2]
[null,"Czechia","Females","25 to 74 years",2013,7.4999999999999997E-2]
[null,"Czechia","Females","25 to 74 years",2014,6.8000000000000005E-2]
[null,"Czechia","Females","25 to 74 years",2015,5.5E-2]
[null,"Czechia","Females","25 to 74 years",2016,4.2999999999999997E-2]
[null,"Czechia","Females","25 to 74 years",2017,3.3000000000000002E-2]
[null,"Czechia","Females","25 to 74 years",2018,2.6000000000000002E-2]
[null,"Czechia","Females","25 to 74 years",2019,2.2000000000000002E-2]
[null,"Czechia","Females","25 to 74 years",2020,2.7000000000000003E-2]
[null,"Czechia","Females","25 to 74 years",2021,3.2000000000000001E-2]
[null,"Czechia","Females","25 to 74 years",2022,2.5000000000000001E-2]
[null,"Czechia","Females","25 to 74 years",2023,2.7000000000000003E-2]
[null,"Czechia","Females","25 to 74 years",2024,2.7000000000000003E-2]
[null,"Denmark","Females","25 to 74 years",2010,5.5999999999999994E-2]
[null,"Denmark","Females","25 to 74 years",2011,6.4000000000000001E-2]
[null,"Denmark","Females","25 to 74 years",2012,6.5000000000000002E-2]
[null,"Denmark","Females","25 to 74 years",2013,6.7000000000000004E-2]
[null,"Denmark","Females","25 to 74 years",2014,6.0999999999999999E-2]
[null,"Denmark","Females","25 to 74 years",2015,5.7000000000000002E-2]
[null,"Denmark","Females","25 to 74 years",2016,5.5E-2]
[null,"Denmark","Females","25 to 74 years",2017,0.05]
[null,"Denmark","Females","25 to 74 years",2018,4.5999999999999999E-2]
[null,"Denmark","Females","25 to 74 years",2019,4.4999999999999998E-2]
[null,"Denmark","Females","25 to 74 years",2020,5.2000000000000005E-2]
[null,"Denmark","Females","25 to 74 years",2021,4.2000000000000003E-2]
[null,"Denmark","Females","25 to 74 years",2022,3.5000000000000003E-2]
[null,"Denmark","Females","25 to 74 years",2023,4.2000000000000003E-2]
[null,"Denmark","Females","25 to 74 years",2024,5.0999999999999997E-2]
[null,"Estonia","Females","25 to 74 years",2010,0.124]
[null,"Estonia","Females","25 to 74 years",2011,0.106]
[null,"Estonia","Females","25 to 74 years",2012,0.08]
[null,"Estonia","Females","25 to 74 years",2013,6.9000000000000006E-2]
[null,"Estonia","Females","25 to 74 years",2014,6.4000000000000001E-2]
[null,"Estonia","Females","25 to 74 years",2015,5.7000000000000002E-2]
[null,"Estonia","Females","25 to 74 years",2016,5.7000000000000002E-2]
[null,"Estonia","Females","25 to 74 years",2017,4.8000000000000001E-2]
[null,"Estonia","Females","25 to 74 years",2018,4.7E-2]
[null,"Estonia","Females","25 to 74 years",2019,4.2000000000000003E-2]
[null,"Estonia","Females","25 to 74 years",2020,5.7000000000000002E-2]
[null,"Estonia","Females","25 to 74 years",2021,4.8000000000000001E-2]
[null,"Estonia","Females","25 to 74 years",2022,0.04]
[null,"Estonia","Females","25 to 74 years",2023,5.7999999999999996E-2]
[null,"Estonia","Females","25 to 74 years",2024,6.4000000000000001E-2]
[null,"Finland","Females","25 to 74 years",2010,0.06]
[null,"Finland","Females","25 to 74 years",2011,5.5999999999999994E-2]
[null,"Finland","Females","25 to 74 years",2012,5.5E-2]
[null,"Finland","Females","25 to 74 years",2013,6.0999999999999999E-2]
[null,"Finland","Females","25 to 74 years",2014,6.4000000000000001E-2]
[null,"Finland","Females","25 to 74 years",2015,7.0999999999999994E-2]
[null,"Finland","Females","25 to 74 years",2016,6.9000000000000006E-2]
[null,"Finland","Females","25 to 74 years",2017,6.7000000000000004E-2]
[null,"Finland","Females","25 to 74 years",2018,5.7999999999999996E-2]
[null,"Finland","Females","25 to 74 years",2019,4.9000000000000002E-2]
[null,"Finland","Females","25 to 74 years",2020,5.7999999999999996E-2]
[null,"Finland","Females","25 to 74 years",2021,5.7999999999999996E-2]
[null,"Finland","Females","25 to 74 years",2022,5.4000000000000006E-2]
[null,"Finland","Females","25 to 74 years",2023,5.2000000000000005E-2]
[null,"Finland","Females","25 to 74 years",2024,6.0999999999999999E-2]
[null,"France","Females","25 to 74 years",2010,7.4999999999999997E-2]
[null,"France","Females","25 to 74 years",2011,7.5999999999999998E-2]
[null,"France","Females","25 to 74 years",2012,7.9000000000000001E-2]
[null,"France","Females","25 to 74 years",2013,8.3000000000000004E-2]
[null,"France","Females","25 to 74 years",2014,8.3000000000000004E-2]
[null,"France","Females","25 to 74 years",2015,8.199999999999999E-2]
[null,"France","Females","25 to 74 years",2016,8.1000000000000003E-2]
[null,"France","Females","25 to 74 years",2017,7.9000000000000001E-2]
[null,"France","Females","25 to 74 years",2018,7.5999999999999998E-2]
[null,"France","Females","25 to 74 years",2019,7.0999999999999994E-2]
[null,"France","Females","25 to 74 years",2020,6.5000000000000002E-2]
[null,"France","Females","25 to 74 years",2021,6.6000000000000003E-2]
[null,"France","Females","25 to 74 years",2022,6.0999999999999999E-2]
[null,"France","Females","25 to 74 years",2023,6.2E-2]
[null,"France","Females","25 to 74 years",2024,0.06]
[null,"Germany","Females","25 to 74 years",2010,5.7000000000000002E-2]
[null,"Germany","Females","25 to 74 years",2011,4.9000000000000002E-2]
[null,"Germany","Females","25 to 74 years",2012,4.4999999999999998E-2]
[null,"Germany","Females","25 to 74 years",2013,4.2999999999999997E-2]
[null,"Germany","Females","25 to 74 years",2014,0.04]
[null,"Germany","Females","25 to 74 years",2015,3.7000000000000005E-2]
[null,"Germany","Females","25 to 74 years",2016,3.2000000000000001E-2]
[null,"Germany","Females","25 to 74 years",2017,2.7999999999999997E-2]
[null,"Germany","Females","25 to 74 years",2018,2.4E-2]
[null,"Germany","Females","25 to 74 years",2019,2.3E-2]
[null,"Germany","Females","25 to 74 years",2020,2.7999999999999997E-2]
[null,"Germany","Females","25 to 74 years",2021,2.7999999999999997E-2]
[null,"Germany","Females","25 to 74 years",2022,2.6000000000000002E-2]
[null,"Germany","Females","25 to 74 years",2023,2.6000000000000002E-2]
[null,"Germany","Females","25 to 74 years",2024,2.7999999999999997E-2]
[null,"Greece","Females","25 to 74 years",2010,0.14699999999999999]
[null,"Greece","Females","25 to 74 years",2011,0.19399999999999998]
[null,"Greece","Females","25 to 74 years",2012,0.25900000000000001]
[null,"Greece","Females","25 to 74 years",2013,0.29299999999999998]
[null,"Greece","Females","25 to 74 years",2014,0.28300000000000003]
[null,"Greece","Females","25 to 74 years",2015,0.27200000000000002]
[null,"Greece","Females","25 to 74 years",2016,0.27100000000000002]
[null,"Greece","Females","25 to 74 years",2017,0.25]
[null,"Greece","Females","25 to 74 years",2018,0.23499999999999999]
[null,"Greece","Females","25 to 74 years",2019,0.21299999999999999]
[null,"Greece","Females","25 to 74 years",2020,0.20399999999999999]
[null,"Greece","Females","25 to 74 years",2021,0.17800000000000002]
[null,"Greece","Females","25 to 74 years",2022,0.152]
[null,"Greece","Females","25 to 74 years",2023,0.13400000000000001]
[null,"Greece","Females","25 to 74 years",2024,0.121]
[null,"Hungary","Females","25 to 74 years",2010,0.09]
[null,"Hungary","Females","25 to 74 years",2011,9.3000000000000013E-2]
[null,"Hungary","Females","25 to 74 years",2012,8.8000000000000009E-2]
[null,"Hungary","Females","25 to 74 years",2013,8.3000000000000004E-2]
[null,"Hungary","Females","25 to 74 years",2014,6.5000000000000002E-2]
[null,"Hungary","Females","25 to 74 years",2015,0.06]
[null,"Hungary","Females","25 to 74 years",2016,4.2000000000000003E-2]
[null,"Hungary","Females","25 to 74 years",2017,3.7999999999999999E-2]
[null,"Hungary","Females","25 to 74 years",2018,3.3000000000000002E-2]
[null,"Hungary","Females","25 to 74 years",2019,2.7999999999999997E-2]
[null,"Hungary","Females","25 to 74 years",2020,3.6000000000000004E-2]
[null,"Hungary","Females","25 to 74 years",2021,3.5000000000000003E-2]
[null,"Hungary","Females","25 to 74 years",2022,3.1E-2]
[null,"Hungary","Females","25 to 74 years",2023,3.7000000000000005E-2]
[null,"Hungary","Females","25 to 74 years",2024,3.7000000000000005E-2]
[null,"Ireland","Females","25 to 74 years",2010,9.6999999999999989E-2]
[null,"Ireland","Females","25 to 74 years",2011,0.109]
[null,"Ireland","Females","25 to 74 years",2012,0.111]
[null,"Ireland","Females","25 to 74 years",2013,0.109]
[null,"Ireland","Females","25 to 74 years",2014,9.6000000000000002E-2]
[null,"Ireland","Females","25 to 74 years",2015,7.9000000000000001E-2]
[null,"Ireland","Females","25 to 74 years",2016,6.7000000000000004E-2]
[null,"Ireland","Females","25 to 74 years",2017,5.4000000000000006E-2]
[null,"Ireland","Females","25 to 74 years",2018,4.8000000000000001E-2]
[null,"Ireland","Females","25 to 74 years",2019,3.9E-2]
[null,"Ireland","Females","25 to 74 years",2020,4.4999999999999998E-2]
[null,"Ireland","Females","25 to 74 years",2021,4.9000000000000002E-2]
[null,"Ireland","Females","25 to 74 years",2022,3.7999999999999999E-2]
[null,"Ireland","Females","25 to 74 years",2023,3.2000000000000001E-2]
[null,"Ireland","Females","25 to 74 years",2024,3.4000000000000002E-2]
[null,"Italy","Females","25 to 74 years",2010,8.3000000000000004E-2]
[null,"Italy","Females","25 to 74 years",2011,8.1000000000000003E-2]
[null,"Italy","Females","25 to 74 years",2012,0.10199999999999999]
[null,"Italy","Females","25 to 74 years",2013,0.113]
[null,"Italy","Females","25 to 74 years",2014,0.11800000000000001]
[null,"Italy","Females","25 to 74 years",2015,0.109]
[null,"Italy","Females","25 to 74 years",2016,0.111]
[null,"Italy","Females","25 to 74 years",2017,0.109]
[null,"Italy","Females","25 to 74 years",2018,0.10400000000000001]
[null,"Italy","Females","25 to 74 years",2019,9.9000000000000005E-2]
[null,"Italy","Females","25 to 74 years",2020,9.1999999999999998E-2]
[null,"Italy","Females","25 to 74 years",2021,9.4E-2]
[null,"Italy","Females","25 to 74 years",2022,8.4000000000000005E-2]
[null,"Italy","Females","25 to 74 years",2023,7.8E-2]
[null,"Italy","Females","25 to 74 years",2024,6.6000000000000003E-2]
[null,"Latvia","Females","25 to 74 years",2010,0.14400000000000002]
[null,"Latvia","Females","25 to 74 years",2011,0.122]
[null,"Latvia","Females","25 to 74 years",2012,0.126]
[null,"Latvia","Females","25 to 74 years",2013,0.1]
[null,"Latvia","Females","25 to 74 years",2014,9.0999999999999998E-2]
[null,"Latvia","Females","25 to 74 years",2015,8.199999999999999E-2]
[null,"Latvia","Females","25 to 74 years",2016,8.199999999999999E-2]
[null,"Latvia","Females","25 to 74 years",2017,7.2000000000000008E-2]
[null,"Latvia","Females","25 to 74 years",2018,6.0999999999999999E-2]
[null,"Latvia","Females","25 to 74 years",2019,5.2000000000000005E-2]
[null,"Latvia","Females","25 to 74 years",2020,6.6000000000000003E-2]
[null,"Latvia","Females","25 to 74 years",2021,6.0999999999999999E-2]
[null,"Latvia","Females","25 to 74 years",2022,5.2999999999999999E-2]
[null,"Latvia","Females","25 to 74 years",2023,5.0999999999999997E-2]
[null,"Latvia","Females","25 to 74 years",2024,5.2000000000000005E-2]
[null,"Lithuania","Females","25 to 74 years",2010,0.13200000000000001]
[null,"Lithuania","Females","25 to 74 years",2011,0.11699999999999999]
[null,"Lithuania","Females","25 to 74 years",2012,0.10800000000000001]
[null,"Lithuania","Females","25 to 74 years",2013,9.6999999999999989E-2]
[null,"Lithuania","Females","25 to 74 years",2014,8.5000000000000006E-2]
[null,"Lithuania","Females","25 to 74 years",2015,7.4999999999999997E-2]
[null,"Lithuania","Females","25 to 74 years",2016,6.2E-2]
[null,"Lithuania","Females","25 to 74 years",2017,5.2999999999999999E-2]
[null,"Lithuania","Females","25 to 74 years",2018,5.0999999999999997E-2]
[null,"Lithuania","Females","25 to 74 years",2019,5.2000000000000005E-2]
[null,"Lithuania","Females","25 to 74 years",2020,7.0999999999999994E-2]
[null,"Lithuania","Females","25 to 74 years",2021,6.0999999999999999E-2]
[null,"Lithuania","Females","25 to 74 years",2022,5.2000000000000005E-2]
[null,"Lithuania","Females","25 to 74 years",2023,6.2E-2]
[null,"Lithuania","Females","25 to 74 years",2024,5.7999999999999996E-2]
[null,"Luxembourg","Females","25 to 74 years",2010,4.7E-2]
[null,"Luxembourg","Females","25 to 74 years",2011,5.2000000000000005E-2]
[null,"Luxembourg","Females","25 to 74 years",2012,0.05]
[null,"Luxembourg","Females","25 to 74 years",2013,6.0999999999999999E-2]
[null,"Luxembourg","Females","25 to 74 years",2014,0.05]
[null,"Luxembourg","Females","25 to 74 years",2015,6.6000000000000003E-2]
[null,"Luxembourg","Females","25 to 74 years",2016,5.5999999999999994E-2]
[null,"Luxembourg","Females","25 to 74 years",2017,4.9000000000000002E-2]
[null,"Luxembourg","Females","25 to 74 years",2018,5.4000000000000006E-2]
[null,"Luxembourg","Females","25 to 74 years",2019,4.7E-2]
[null,"Luxembourg","Females","25 to 74 years",2020,5.7999999999999996E-2]
[null,"Luxembourg","Females","25 to 74 years",2021,4.7E-2]
[null,"Luxembourg","Females","25 to 74 years",2022,3.6000000000000004E-2]
[null,"Luxembourg","Females","25 to 74 years",2023,4.0999999999999995E-2]
[null,"Luxembourg","Females","25 to 74 years",2024,5.2999999999999999E-2]
[null,"Malta","Females","25 to 74 years",2010,5.7999999999999996E-2]
[null,"Malta","Females","25 to 74 years",2011,5.5999999999999994E-2]
[null,"Malta","Females","25 to 74 years",2012,5.5E-2]
[null,"Malta","Females","25 to 74 years",2013,5.2000000000000005E-2]
[null,"Malta","Females","25 to 74 years",2014,4.2000000000000003E-2]
[null,"Malta","Females","25 to 74 years",2015,4.4999999999999998E-2]
[null,"Malta","Females","25 to 74 years",2016,4.0999999999999995E-2]
[null,"Malta","Females","25 to 74 years",2017,3.3000000000000002E-2]
[null,"Malta","Females","25 to 74 years",2018,3.2000000000000001E-2]
[null,"Malta","Females","25 to 74 years",2019,4.0999999999999995E-2]
[null,"Malta","Females","25 to 74 years",2020,4.7E-2]
[null,"Malta","Females","25 to 74 years",2021,3.3000000000000002E-2]
[null,"Malta","Females","25 to 74 years",2022,2.7999999999999997E-2]
[null,"Malta","Females","25 to 74 years",2023,2.8999999999999998E-2]
[null,"Malta","Females","25 to 74 years",2024,2.4E-2]
[null,"Netherlands","Females","25 to 74 years",2010,5.7999999999999996E-2]
[null,"Netherlands","Females","25 to 74 years",2011,5.7000000000000002E-2]
[null,"Netherlands","Females","25 to 74 years",2012,6.3E-2]
[null,"Netherlands","Females","25 to 74 years",2013,7.2999999999999995E-2]
[null,"Netherlands","Females","25 to 74 years",2014,7.8E-2]
[null,"Netherlands","Females","25 to 74 years",2015,7.5999999999999998E-2]
[null,"Netherlands","Females","25 to 74 years",2016,6.9000000000000006E-2]
[null,"Netherlands","Females","25 to 74 years",2017,5.7000000000000002E-2]
[null,"Netherlands","Females","25 to 74 years",2018,4.4999999999999998E-2]
[null,"Netherlands","Females","25 to 74 years",2019,3.9E-2]
[null,"Netherlands","Females","25 to 74 years",2020,0.04]
[null,"Netherlands","Females","25 to 74 years",2021,3.5000000000000003E-2]
[null,"Netherlands","Females","25 to 74 years",2022,2.8999999999999998E-2]
[null,"Netherlands","Females","25 to 74 years",2023,2.7000000000000003E-2]
[null,"Netherlands","Females","25 to 74 years",2024,2.7999999999999997E-2]
[null,"Poland","Females","25 to 74 years",2010,8.6999999999999994E-2]
[null,"Poland","Females","25 to 74 years",2011,8.900000000000001E-2]
[null,"Poland","Females","25 to 74 years",2012,9.4E-2]
[null,"Poland","Females","25 to 74 years",2013,9.6999999999999989E-2]
[null,"Poland","Females","25 to 74 years",2014,8.5000000000000006E-2]
[null,"Poland","Females","25 to 74 years",2015,6.8000000000000005E-2]
[null,"Poland","Females","25 to 74 years",2016,5.4000000000000006E-2]
[null,"Poland","Females","25 to 74 years",2017,4.2000000000000003E-2]
[null,"Poland","Females","25 to 74 years",2018,3.2000000000000001E-2]
[null,"Poland","Females","25 to 74 years",2019,3.1E-2]
[null,"Poland","Females","25 to 74 years",2020,2.7999999999999997E-2]
[null,"Poland","Females","25 to 74 years",2021,2.7999999999999997E-2]
[null,"Poland","Females","25 to 74 years",2022,2.4E-2]
[null,"Poland","Females","25 to 74 years",2023,2.3E-2]
[null,"Poland","Females","25 to 74 years",2024,2.6000000000000002E-2]
[null,"Portugal","Females","25 to 74 years",2010,0.113]
[null,"Portugal","Females","25 to 74 years",2011,0.12300000000000001]
[null,"Portugal","Females","25 to 74 years",2012,0.14499999999999999]
[null,"Portugal","Females","25 to 74 years",2013,0.154]
[null,"Portugal","Females","25 to 74 years",2014,0.13200000000000001]
[null,"Portugal","Females","25 to 74 years",2015,0.114]
[null,"Portugal","Females","25 to 74 years",2016,0.10199999999999999]
[null,"Portugal","Females","25 to 74 years",2017,8.4000000000000005E-2]
[null,"Portugal","Females","25 to 74 years",2018,6.6000000000000003E-2]
[null,"Portugal","Females","25 to 74 years",2019,6.2E-2]
[null,"Portugal","Females","25 to 74 years",2020,6.0999999999999999E-2]
[null,"Portugal","Females","25 to 74 years",2021,5.7999999999999996E-2]
[null,"Portugal","Females","25 to 74 years",2022,5.7000000000000002E-2]
[null,"Portugal","Females","25 to 74 years",2023,5.9000000000000004E-2]
[null,"Portugal","Females","25 to 74 years",2024,5.7999999999999996E-2]
[null,"Romania","Females","25 to 74 years",2010,6.6000000000000003E-2]
[null,"Romania","Females","25 to 74 years",2011,6.7000000000000004E-2]
[null,"Romania","Females","25 to 74 years",2012,6.3E-2]
[null,"Romania","Females","25 to 74 years",2013,6.5000000000000002E-2]
[null,"Romania","Females","25 to 74 years",2014,6.3E-2]
[null,"Romania","Females","25 to 74 years",2015,5.7999999999999996E-2]
[null,"Romania","Females","25 to 74 years",2016,4.9000000000000002E-2]
[null,"Romania","Females","25 to 74 years",2017,3.9E-2]
[null,"Romania","Females","25 to 74 years",2018,3.4000000000000002E-2]
[null,"Romania","Females","25 to 74 years",2019,3.2000000000000001E-2]
[null,"Romania","Females","25 to 74 years",2020,4.7E-2]
[null,"Romania","Females","25 to 74 years",2021,0.04]
[null,"Romania","Females","25 to 74 years",2022,3.9E-2]
[null,"Romania","Females","25 to 74 years",2023,4.2000000000000003E-2]
[null,"Romania","Females","25 to 74 years",2024,3.9E-2]
[null,"Slovakia","Females","25 to 74 years",2010,0.13]
[null,"Slovakia","Females","25 to 74 years",2011,0.12]
[null,"Slovakia","Females","25 to 74 years",2012,0.13100000000000001]
[null,"Slovakia","Females","25 to 74 years",2013,0.13200000000000001]
[null,"Slovakia","Females","25 to 74 years",2014,0.124]
[null,"Slovakia","Females","25 to 74 years",2015,0.11800000000000001]
[null,"Slovakia","Females","25 to 74 years",2016,9.6999999999999989E-2]
[null,"Slovakia","Females","25 to 74 years",2017,7.5999999999999998E-2]
[null,"Slovakia","Females","25 to 74 years",2018,6.4000000000000001E-2]
[null,"Slovakia","Females","25 to 74 years",2019,5.2000000000000005E-2]
[null,"Slovakia","Females","25 to 74 years",2020,6.3E-2]
[null,"Slovakia","Females","25 to 74 years",2021,6.3E-2]
[null,"Slovakia","Females","25 to 74 years",2022,5.7000000000000002E-2]
[null,"Slovakia","Females","25 to 74 years",2023,5.5E-2]
[null,"Slovakia","Females","25 to 74 years",2024,5.4000000000000006E-2]
[null,"Slovenia","Females","25 to 74 years",2010,6.5000000000000002E-2]
[null,"Slovenia","Females","25 to 74 years",2011,7.4999999999999997E-2]
[null,"Slovenia","Females","25 to 74 years",2012,8.5999999999999993E-2]
[null,"Slovenia","Females","25 to 74 years",2013,0.1]
[null,"Slovenia","Females","25 to 74 years",2014,9.8000000000000004E-2]
[null,"Slovenia","Females","25 to 74 years",2015,9.6999999999999989E-2]
[null,"Slovenia","Females","25 to 74 years",2016,8.199999999999999E-2]
[null,"Slovenia","Females","25 to 74 years",2017,7.0999999999999994E-2]
[null,"Slovenia","Females","25 to 74 years",2018,5.5E-2]
[null,"Slovenia","Females","25 to 74 years",2019,4.7E-2]
[null,"Slovenia","Females","25 to 74 years",2020,5.0999999999999997E-2]
[null,"Slovenia","Females","25 to 74 years",2021,4.7E-2]
[null,"Slovenia","Females","25 to 74 years",2022,3.7999999999999999E-2]
[null,"Slovenia","Females","25 to 74 years",2023,3.4000000000000002E-2]
[null,"Slovenia","Females","25 to 74 years",2024,3.5000000000000003E-2]
[null,"Spain","Females","25 to 74 years",2010,0.183]
[null,"Spain","Females","25 to 74 years",2011,0.19699999999999998]
[null,"Spain","Females","25 to 74 years",2012,0.22800000000000001]
[null,"Spain","Females","25 to 74 years",2013,0.24399999999999999]
[null,"Spain","Females","25 to 74 years",2014,0.23399999999999999]
[null,"Spain","Females","25 to 74 years",2015,0.218]
[null,"Spain","Females","25 to 74 years",2016,0.19800000000000001]
[null,"Spain","Females","25 to 74 years",2017,0.17699999999999999]
[null,"Spain","Females","25 to 74 years",2018,0.159]
[null,"Spain","Females","25 to 74 years",2019,0.14699999999999999]
[null,"Spain","Females","25 to 74 years",2020,0.16]
[null,"Spain","Females","25 to 74 years",2021,0.155]
[null,"Spain","Females","25 to 74 years",2022,0.13800000000000001]
[null,"Spain","Females","25 to 74 years",2023,0.128]
[null,"Spain","Females","25 to 74 years",2024,0.11599999999999999]
[null,"Sweden","Females","25 to 74 years",2010,6.4000000000000001E-2]
[null,"Sweden","Females","25 to 74 years",2011,5.7000000000000002E-2]
[null,"Sweden","Females","25 to 74 years",2012,5.7000000000000002E-2]
[null,"Sweden","Females","25 to 74 years",2013,5.7999999999999996E-2]
[null,"Sweden","Females","25 to 74 years",2014,5.7999999999999996E-2]
[null,"Sweden","Females","25 to 74 years",2015,5.7000000000000002E-2]
[null,"Sweden","Females","25 to 74 years",2016,5.2999999999999999E-2]
[null,"Sweden","Females","25 to 74 years",2017,5.2000000000000005E-2]
[null,"Sweden","Females","25 to 74 years",2018,5.0999999999999997E-2]
[null,"Sweden","Females","25 to 74 years",2019,5.5E-2]
[null,"Sweden","Females","25 to 74 years",2020,6.8000000000000005E-2]
[null,"Sweden","Females","25 to 74 years",2021,7.2999999999999995E-2]
[null,"Sweden","Females","25 to 74 years",2022,5.7999999999999996E-2]
[null,"Sweden","Females","25 to 74 years",2023,6.0999999999999999E-2]
[null,"Sweden","Females","25 to 74 years",2024,6.5000000000000002E-2]
[null,"Austria","Females","55 to 74 years",2010,1.8000000000000002E-2]
[null,"Austria","Females","55 to 74 years",2011,2.4E-2]
[null,"Austria","Females","55 to 74 years",2012,2.6000000000000002E-2]
[null,"Austria","Females","55 to 74 years",2013,3.1E-2]
[null,"Austria","Females","55 to 74 years",2014,2.7000000000000003E-2]
[null,"Austria","Females","55 to 74 years",2015,3.3000000000000002E-2]
[null,"Austria","Females","55 to 74 years",2016,3.7000000000000005E-2]
[null,"Austria","Females","55 to 74 years",2017,3.6000000000000004E-2]
[null,"Austria","Females","55 to 74 years",2018,3.7000000000000005E-2]
[null,"Austria","Females","55 to 74 years",2019,2.8999999999999998E-2]
[null,"Austria","Females","55 to 74 years",2020,3.9E-2]
[null,"Austria","Females","55 to 74 years",2021,4.4000000000000004E-2]
[null,"Austria","Females","55 to 74 years",2022,2.7999999999999997E-2]
[null,"Austria","Females","55 to 74 years",2023,2.8999999999999998E-2]
[null,"Austria","Females","55 to 74 years",2024,2.6000000000000002E-2]
[null,"Belgium","Females","55 to 74 years",2010,5.2000000000000005E-2]
[null,"Belgium","Females","55 to 74 years",2011,4.2000000000000003E-2]
[null,"Belgium","Females","55 to 74 years",2012,4.9000000000000002E-2]
[null,"Belgium","Females","55 to 74 years",2013,5.2999999999999999E-2]
[null,"Belgium","Females","55 to 74 years",2014,5.0999999999999997E-2]
[null,"Belgium","Females","55 to 74 years",2015,4.5999999999999999E-2]
[null,"Belgium","Females","55 to 74 years",2016,0.06]
[null,"Belgium","Females","55 to 74 years",2017,6.4000000000000001E-2]
[null,"Belgium","Females","55 to 74 years",2018,3.6000000000000004E-2]
[null,"Belgium","Females","55 to 74 years",2019,3.9E-2]
[null,"Belgium","Females","55 to 74 years",2020,3.6000000000000004E-2]
[null,"Belgium","Females","55 to 74 years",2021,4.2000000000000003E-2]
[null,"Belgium","Females","55 to 74 years",2022,3.4000000000000002E-2]
[null,"Belgium","Females","55 to 74 years",2023,3.2000000000000001E-2]
[null,"Belgium","Females","55 to 74 years",2024,3.1E-2]
[null,"Bulgaria","Females","55 to 74 years",2010,9.5000000000000001E-2]
[null,"Bulgaria","Females","55 to 74 years",2011,8.900000000000001E-2]
[null,"Bulgaria","Females","55 to 74 years",2012,9.9000000000000005E-2]
[null,"Bulgaria","Females","55 to 74 years",2013,0.121]
[null,"Bulgaria","Females","55 to 74 years",2014,0.111]
[null,"Bulgaria","Females","55 to 74 years",2015,8.5000000000000006E-2]
[null,"Bulgaria","Females","55 to 74 years",2016,7.2000000000000008E-2]
[null,"Bulgaria","Females","55 to 74 years",2017,5.9000000000000004E-2]
[null,"Bulgaria","Females","55 to 74 years",2018,4.4999999999999998E-2]
[null,"Bulgaria","Females","55 to 74 years",2019,4.4000000000000004E-2]
[null,"Bulgaria","Females","55 to 74 years",2020,4.7E-2]
[null,"Bulgaria","Females","55 to 74 years",2021,3.9E-2]
[null,"Bulgaria","Females","55 to 74 years",2022,0.03]
[null,"Bulgaria","Females","55 to 74 years",2023,3.4000000000000002E-2]
[null,"Bulgaria","Females","55 to 74 years",2024,3.2000000000000001E-2]
[null,"Croatia","Females","55 to 74 years",2010,4.5999999999999999E-2]
[null,"Croatia","Females","55 to 74 years",2011,5.5999999999999994E-2]
[null,"Croatia","Females","55 to 74 years",2012,8.4000000000000005E-2]
[null,"Croatia","Females","55 to 74 years",2013,6.6000000000000003E-2]
[null,"Croatia","Females","55 to 74 years",2014,0.11]
[null,"Croatia","Females","55 to 74 years",2015,9.8000000000000004E-2]
[null,"Croatia","Females","55 to 74 years",2016,6.9000000000000006E-2]
[null,"Croatia","Females","55 to 74 years",2017,7.9000000000000001E-2]
[null,"Croatia","Females","55 to 74 years",2018,0.04]
[null,"Croatia","Females","55 to 74 years",2019,4.2000000000000003E-2]
[null,"Croatia","Females","55 to 74 years",2020,5.0999999999999997E-2]
[null,"Croatia","Females","55 to 74 years",2021,4.7E-2]
[null,"Croatia","Females","55 to 74 years",2022,5.2000000000000005E-2]
[null,"Croatia","Females","55 to 74 years",2023,4.8000000000000001E-2]
[null,"Croatia","Females","55 to 74 years",2024,4.2999999999999997E-2]
[null,"Cyprus","Females","55 to 74 years",2010,3.6000000000000004E-2]
[null,"Cyprus","Females","55 to 74 years",2011,4.0999999999999995E-2]
[null,"Cyprus","Females","55 to 74 years",2012,6.8000000000000005E-2]
[null,"Cyprus","Females","55 to 74 years",2013,8.5999999999999993E-2]
[null,"Cyprus","Females","55 to 74 years",2014,0.12300000000000001]
[null,"Cyprus","Females","55 to 74 years",2015,0.11800000000000001]
[null,"Cyprus","Females","55 to 74 years",2016,7.8E-2]
[null,"Cyprus","Females","55 to 74 years",2017,5.2000000000000005E-2]
[null,"Cyprus","Females","55 to 74 years",2018,4.7E-2]
[null,"Cyprus","Females","55 to 74 years",2019,5.7000000000000002E-2]
[null,"Cyprus","Females","55 to 74 years",2020,5.5999999999999994E-2]
[null,"Cyprus","Females","55 to 74 years",2021,0.06]
[null,"Cyprus","Females","55 to 74 years",2022,4.0999999999999995E-2]
[null,"Cyprus","Females","55 to 74 years",2023,3.7999999999999999E-2]
[null,"Cyprus","Females","55 to 74 years",2024,3.1E-2]
[null,"Czechia","Females","55 to 74 years",2010,6.0999999999999999E-2]
[null,"Czechia","Females","55 to 74 years",2011,5.4000000000000006E-2]
[null,"Czechia","Females","55 to 74 years",2012,5.7999999999999996E-2]
[null,"Czechia","Females","55 to 74 years",2013,5.9000000000000004E-2]
[null,"Czechia","Females","55 to 74 years",2014,0.05]
[null,"Czechia","Females","55 to 74 years",2015,4.4000000000000004E-2]
[null,"Czechia","Females","55 to 74 years",2016,3.5000000000000003E-2]
[null,"Czechia","Females","55 to 74 years",2017,2.7000000000000003E-2]
[null,"Czechia","Females","55 to 74 years",2018,2.2000000000000002E-2]
[null,"Czechia","Females","55 to 74 years",2019,1.8000000000000002E-2]
[null,"Czechia","Females","55 to 74 years",2020,2.1000000000000001E-2]
[null,"Czechia","Females","55 to 74 years",2021,2.6000000000000002E-2]
[null,"Czechia","Females","55 to 74 years",2022,2.1000000000000001E-2]
[null,"Czechia","Females","55 to 74 years",2023,2.1000000000000001E-2]
[null,"Czechia","Females","55 to 74 years",2024,0.02]
[null,"Denmark","Females","55 to 74 years",2010,3.9E-2]
[null,"Denmark","Females","55 to 74 years",2011,4.2000000000000003E-2]
[null,"Denmark","Females","55 to 74 years",2012,5.0999999999999997E-2]
[null,"Denmark","Females","55 to 74 years",2013,4.9000000000000002E-2]
[null,"Denmark","Females","55 to 74 years",2014,4.2000000000000003E-2]
[null,"Denmark","Females","55 to 74 years",2015,4.4000000000000004E-2]
[null,"Denmark","Females","55 to 74 years",2016,3.6000000000000004E-2]
[null,"Denmark","Females","55 to 74 years",2017,3.2000000000000001E-2]
[null,"Denmark","Females","55 to 74 years",2018,3.6000000000000004E-2]
[null,"Denmark","Females","55 to 74 years",2019,3.2000000000000001E-2]
[null,"Denmark","Females","55 to 74 years",2020,4.0999999999999995E-2]
[null,"Denmark","Females","55 to 74 years",2021,3.7000000000000005E-2]
[null,"Denmark","Females","55 to 74 years",2022,2.8999999999999998E-2]
[null,"Denmark","Females","55 to 74 years",2023,3.1E-2]
[null,"Denmark","Females","55 to 74 years",2024,3.7999999999999999E-2]
[null,"Estonia","Females","55 to 74 years",2010,0.122]
[null,"Estonia","Females","55 to 74 years",2011,8.1000000000000003E-2]
[null,"Estonia","Females","55 to 74 years",2012,5.2000000000000005E-2]
[null,"Estonia","Females","55 to 74 years",2013,3.7000000000000005E-2]
[null,"Estonia","Females","55 to 74 years",2014,4.7E-2]
[null,"Estonia","Females","55 to 74 years",2015,5.2999999999999999E-2]
[null,"Estonia","Females","55 to 74 years",2016,0.06]
[null,"Estonia","Females","55 to 74 years",2017,3.7999999999999999E-2]
[null,"Estonia","Females","55 to 74 years",2018,3.7999999999999999E-2]
[null,"Estonia","Females","55 to 74 years",2019,2.8999999999999998E-2]
[null,"Estonia","Females","55 to 74 years",2020,0.05]
[null,"Estonia","Females","55 to 74 years",2021,4.4999999999999998E-2]
[null,"Estonia","Females","55 to 74 years",2022,3.3000000000000002E-2]
[null,"Estonia","Females","55 to 74 years",2023,5.2000000000000005E-2]
[null,"Estonia","Females","55 to 74 years",2024,4.9000000000000002E-2]
[null,"Finland","Females","55 to 74 years",2010,5.5E-2]
[null,"Finland","Females","55 to 74 years",2011,5.0999999999999997E-2]
[null,"Finland","Females","55 to 74 years",2012,4.8000000000000001E-2]
[null,"Finland","Females","55 to 74 years",2013,5.5E-2]
[null,"Finland","Females","55 to 74 years",2014,5.9000000000000004E-2]
[null,"Finland","Females","55 to 74 years",2015,6.2E-2]
[null,"Finland","Females","55 to 74 years",2016,6.3E-2]
[null,"Finland","Females","55 to 74 years",2017,6.4000000000000001E-2]
[null,"Finland","Females","55 to 74 years",2018,5.5E-2]
[null,"Finland","Females","55 to 74 years",2019,4.9000000000000002E-2]
[null,"Finland","Females","55 to 74 years",2020,6.3E-2]
[null,"Finland","Females","55 to 74 years",2021,6.5000000000000002E-2]
[null,"Finland","Females","55 to 74 years",2022,5.2999999999999999E-2]
[null,"Finland","Females","55 to 74 years",2023,5.5999999999999994E-2]
[null,"Finland","Females","55 to 74 years",2024,5.7999999999999996E-2]
[null,"France","Females","55 to 74 years",2010,5.5E-2]
[null,"France","Females","55 to 74 years",2011,5.5E-2]
[null,"France","Females","55 to 74 years",2012,5.7999999999999996E-2]
[null,"France","Females","55 to 74 years",2013,6.4000000000000001E-2]
[null,"France","Females","55 to 74 years",2014,6.6000000000000003E-2]
[null,"France","Females","55 to 74 years",2015,6.5000000000000002E-2]
[null,"France","Females","55 to 74 years",2016,6.0999999999999999E-2]
[null,"France","Females","55 to 74 years",2017,5.5999999999999994E-2]
[null,"France","Females","55 to 74 years",2018,6.0999999999999999E-2]
[null,"France","Females","55 to 74 years",2019,6.5000000000000002E-2]
[null,"France","Females","55 to 74 years",2020,5.5E-2]
[null,"France","Females","55 to 74 years",2021,0.06]
[null,"France","Females","55 to 74 years",2022,5.5E-2]
[null,"France","Females","55 to 74 years",2023,0.05]
[null,"France","Females","55 to 74 years",2024,4.9000000000000002E-2]
[null,"Germany","Females","55 to 74 years",2010,6.2E-2]
[null,"Germany","Females","55 to 74 years",2011,5.5E-2]
[null,"Germany","Females","55 to 74 years",2012,4.8000000000000001E-2]
[null,"Germany","Females","55 to 74 years",2013,4.4999999999999998E-2]
[null,"Germany","Females","55 to 74 years",2014,0.04]
[null,"Germany","Females","55 to 74 years",2015,3.5000000000000003E-2]
[null,"Germany","Females","55 to 74 years",2016,3.1E-2]
[null,"Germany","Females","55 to 74 years",2017,2.7000000000000003E-2]
[null,"Germany","Females","55 to 74 years",2018,2.2000000000000002E-2]
[null,"Germany","Females","55 to 74 years",2019,2.1000000000000001E-2]
[null,"Germany","Females","55 to 74 years",2020,2.4E-2]
[null,"Germany","Females","55 to 74 years",2021,2.6000000000000002E-2]
[null,"Germany","Females","55 to 74 years",2022,2.3E-2]
[null,"Germany","Females","55 to 74 years",2023,0.02]
[null,"Germany","Females","55 to 74 years",2024,2.1000000000000001E-2]
[null,"Greece","Females","55 to 74 years",2010,6.0999999999999999E-2]
[null,"Greece","Females","55 to 74 years",2011,7.9000000000000001E-2]
[null,"Greece","Females","55 to 74 years",2012,0.128]
[null,"Greece","Females","55 to 74 years",2013,0.154]
[null,"Greece","Females","55 to 74 years",2014,0.158]
[null,"Greece","Females","55 to 74 years",2015,0.155]
[null,"Greece","Females","55 to 74 years",2016,0.185]
[null,"Greece","Females","55 to 74 years",2017,0.192]
[null,"Greece","Females","55 to 74 years",2018,0.18100000000000002]
[null,"Greece","Females","55 to 74 years",2019,0.155]
[null,"Greece","Females","55 to 74 years",2020,0.13900000000000001]
[null,"Greece","Females","55 to 74 years",2021,0.13699999999999998]
[null,"Greece","Females","55 to 74 years",2022,0.114]
[null,"Greece","Females","55 to 74 years",2023,9.4E-2]
[null,"Greece","Females","55 to 74 years",2024,9.6999999999999989E-2]
[null,"Hungary","Females","55 to 74 years",2010,6.8000000000000005E-2]
[null,"Hungary","Females","55 to 74 years",2011,7.9000000000000001E-2]
[null,"Hungary","Females","55 to 74 years",2012,7.8E-2]
[null,"Hungary","Females","55 to 74 years",2013,7.2999999999999995E-2]
[null,"Hungary","Females","55 to 74 years",2014,5.7999999999999996E-2]
[null,"Hungary","Females","55 to 74 years",2015,5.2999999999999999E-2]
[null,"Hungary","Females","55 to 74 years",2016,4.4000000000000004E-2]
[null,"Hungary","Females","55 to 74 years",2017,0.04]
[null,"Hungary","Females","55 to 74 years",2018,2.7999999999999997E-2]
[null,"Hungary","Females","55 to 74 years",2019,2.1000000000000001E-2]
[null,"Hungary","Females","55 to 74 years",2020,2.7000000000000003E-2]
[null,"Hungary","Females","55 to 74 years",2021,2.7000000000000003E-2]
[null,"Hungary","Females","55 to 74 years",2022,2.8999999999999998E-2]
[null,"Hungary","Females","55 to 74 years",2023,3.1E-2]
[null,"Hungary","Females","55 to 74 years",2024,3.7999999999999999E-2]
[null,"Ireland","Females","55 to 74 years",2010,6.4000000000000001E-2]
[null,"Ireland","Females","55 to 74 years",2011,6.8000000000000005E-2]
[null,"Ireland","Females","55 to 74 years",2012,7.0999999999999994E-2]
[null,"Ireland","Females","55 to 74 years",2013,8.6999999999999994E-2]
[null,"Ireland","Females","55 to 74 years",2014,7.9000000000000001E-2]
[null,"Ireland","Females","55 to 74 years",2015,6.4000000000000001E-2]
[null,"Ireland","Females","55 to 74 years",2016,5.0999999999999997E-2]
[null,"Ireland","Females","55 to 74 years",2017,5.4000000000000006E-2]
[null,"Ireland","Females","55 to 74 years",2018,3.9E-2]
[null,"Ireland","Females","55 to 74 years",2019,3.2000000000000001E-2]
[null,"Ireland","Females","55 to 74 years",2020,3.6000000000000004E-2]
[null,"Ireland","Females","55 to 74 years",2021,5.0999999999999997E-2]
[null,"Ireland","Females","55 to 74 years",2022,3.1E-2]
[null,"Ireland","Females","55 to 74 years",2023,2.8999999999999998E-2]
[null,"Ireland","Females","55 to 74 years",2024,2.8999999999999998E-2]
[null,"Italy","Females","55 to 74 years",2010,2.8999999999999998E-2]
[null,"Italy","Females","55 to 74 years",2011,2.6000000000000002E-2]
[null,"Italy","Females","55 to 74 years",2012,4.2000000000000003E-2]
[null,"Italy","Females","55 to 74 years",2013,4.0999999999999995E-2]
[null,"Italy","Females","55 to 74 years",2014,4.2999999999999997E-2]
[null,"Italy","Females","55 to 74 years",2015,4.2000000000000003E-2]
[null,"Italy","Females","55 to 74 years",2016,4.7E-2]
[null,"Italy","Females","55 to 74 years",2017,4.9000000000000002E-2]
[null,"Italy","Females","55 to 74 years",2018,4.7E-2]
[null,"Italy","Females","55 to 74 years",2019,4.7E-2]
[null,"Italy","Females","55 to 74 years",2020,4.7E-2]
[null,"Italy","Females","55 to 74 years",2021,5.0999999999999997E-2]
[null,"Italy","Females","55 to 74 years",2022,4.8000000000000001E-2]
[null,"Italy","Females","55 to 74 years",2023,4.7E-2]
[null,"Italy","Females","55 to 74 years",2024,3.9E-2]
[null,"Latvia","Females","55 to 74 years",2010,0.11699999999999999]
[null,"Latvia","Females","55 to 74 years",2011,0.11699999999999999]
[null,"Latvia","Females","55 to 74 years",2012,0.125]
[null,"Latvia","Females","55 to 74 years",2013,8.8000000000000009E-2]
[null,"Latvia","Females","55 to 74 years",2014,7.5999999999999998E-2]
[null,"Latvia","Females","55 to 74 years",2015,7.0000000000000007E-2]
[null,"Latvia","Females","55 to 74 years",2016,6.4000000000000001E-2]
[null,"Latvia","Females","55 to 74 years",2017,6.2E-2]
[null,"Latvia","Females","55 to 74 years",2018,0.06]
[null,"Latvia","Females","55 to 74 years",2019,0.05]
[null,"Latvia","Females","55 to 74 years",2020,5.7999999999999996E-2]
[null,"Latvia","Females","55 to 74 years",2021,0.05]
[null,"Latvia","Females","55 to 74 years",2022,4.0999999999999995E-2]
[null,"Latvia","Females","55 to 74 years",2023,4.4000000000000004E-2]
[null,"Latvia","Females","55 to 74 years",2024,4.2999999999999997E-2]
[null,"Lithuania","Females","55 to 74 years",2010,0.111]
[null,"Lithuania","Females","55 to 74 years",2011,9.8000000000000004E-2]
[null,"Lithuania","Females","55 to 74 years",2012,9.3000000000000013E-2]
[null,"Lithuania","Females","55 to 74 years",2013,8.199999999999999E-2]
[null,"Lithuania","Females","55 to 74 years",2014,7.400000000000001E-2]
[null,"Lithuania","Females","55 to 74 years",2015,6.4000000000000001E-2]
[null,"Lithuania","Females","55 to 74 years",2016,5.7999999999999996E-2]
[null,"Lithuania","Females","55 to 74 years",2017,5.5999999999999994E-2]
[null,"Lithuania","Females","55 to 74 years",2018,6.2E-2]
[null,"Lithuania","Females","55 to 74 years",2019,0.06]
[null,"Lithuania","Females","55 to 74 years",2020,0.08]
[null,"Lithuania","Females","55 to 74 years",2021,6.6000000000000003E-2]
[null,"Lithuania","Females","55 to 74 years",2022,5.7000000000000002E-2]
[null,"Lithuania","Females","55 to 74 years",2023,6.0999999999999999E-2]
[null,"Lithuania","Females","55 to 74 years",2024,0.06]
[null,"Luxembourg","Females","55 to 74 years",2010]
[null,"Luxembourg","Females","55 to 74 years",2011]
[null,"Luxembourg","Females","55 to 74 years",2012]
[null,"Luxembourg","Females","55 to 74 years",2013,0.05]
[null,"Luxembourg","Females","55 to 74 years",2014]
[null,"Luxembourg","Females","55 to 74 years",2015]
[null,"Luxembourg","Females","55 to 74 years",2016]
[null,"Luxembourg","Females","55 to 74 years",2017]
[null,"Luxembourg","Females","55 to 74 years",2018]
[null,"Luxembourg","Females","55 to 74 years",2019]
[null,"Luxembourg","Females","55 to 74 years",2020,3.1E-2]
[null,"Luxembourg","Females","55 to 74 years",2021,3.2000000000000001E-2]
[null,"Luxembourg","Females","55 to 74 years",2022,4.4000000000000004E-2]
[null,"Luxembourg","Females","55 to 74 years",2023]
[null,"Luxembourg","Females","55 to 74 years",2024]
[null,"Malta","Females","55 to 74 years",2010]
[null,"Malta","Females","55 to 74 years",2011]
[null,"Malta","Females","55 to 74 years",2012,0.06]
[null,"Malta","Females","55 to 74 years",2013]
[null,"Malta","Females","55 to 74 years",2014]
[null,"Malta","Females","55 to 74 years",2015]
[null,"Malta","Females","55 to 74 years",2016]
[null,"Malta","Females","55 to 74 years",2017]
[null,"Malta","Females","55 to 74 years",2018,4.2999999999999997E-2]
[null,"Malta","Females","55 to 74 years",2019]
[null,"Malta","Females","55 to 74 years",2020,4.5999999999999999E-2]
[null,"Malta","Females","55 to 74 years",2021]
[null,"Malta","Females","55 to 74 years",2022]
[null,"Malta","Females","55 to 74 years",2023]
[null,"Malta","Females","55 to 74 years",2024]
[null,"Netherlands","Females","55 to 74 years",2010,6.2E-2]
[null,"Netherlands","Females","55 to 74 years",2011,6.5000000000000002E-2]
[null,"Netherlands","Females","55 to 74 years",2012,6.7000000000000004E-2]
[null,"Netherlands","Females","55 to 74 years",2013,7.5999999999999998E-2]
[null,"Netherlands","Females","55 to 74 years",2014,8.4000000000000005E-2]
[null,"Netherlands","Females","55 to 74 years",2015,8.8000000000000009E-2]
[null,"Netherlands","Females","55 to 74 years",2016,8.5999999999999993E-2]
[null,"Netherlands","Females","55 to 74 years",2017,7.0999999999999994E-2]
[null,"Netherlands","Females","55 to 74 years",2018,6.0999999999999999E-2]
[null,"Netherlands","Females","55 to 74 years",2019,4.2999999999999997E-2]
[null,"Netherlands","Females","55 to 74 years",2020,3.9E-2]
[null,"Netherlands","Females","55 to 74 years",2021,3.4000000000000002E-2]
[null,"Netherlands","Females","55 to 74 years",2022,3.5000000000000003E-2]
[null,"Netherlands","Females","55 to 74 years",2023,2.7999999999999997E-2]
[null,"Netherlands","Females","55 to 74 years",2024,2.3E-2]
[null,"Poland","Females","55 to 74 years",2010,6.9000000000000006E-2]
[null,"Poland","Females","55 to 74 years",2011,6.3E-2]
[null,"Poland","Females","55 to 74 years",2012,6.7000000000000004E-2]
[null,"Poland","Females","55 to 74 years",2013,7.0000000000000007E-2]
[null,"Poland","Females","55 to 74 years",2014,6.3E-2]
[null,"Poland","Females","55 to 74 years",2015,4.8000000000000001E-2]
[null,"Poland","Females","55 to 74 years",2016,3.5000000000000003E-2]
[null,"Poland","Females","55 to 74 years",2017,0.03]
[null,"Poland","Females","55 to 74 years",2018,1.9E-2]
[null,"Poland","Females","55 to 74 years",2019,1.9E-2]
[null,"Poland","Females","55 to 74 years",2020,1.6E-2]
[null,"Poland","Females","55 to 74 years",2021,1.9E-2]
[null,"Poland","Females","55 to 74 years",2022,1.4999999999999999E-2]
[null,"Poland","Females","55 to 74 years",2023,1.4999999999999999E-2]
[null,"Poland","Females","55 to 74 years",2024,1.4999999999999999E-2]
[null,"Portugal","Females","55 to 74 years",2010,7.6999999999999999E-2]
[null,"Portugal","Females","55 to 74 years",2011,0.10400000000000001]
[null,"Portugal","Females","55 to 74 years",2012,0.11599999999999999]
[null,"Portugal","Females","55 to 74 years",2013,0.128]
[null,"Portugal","Females","55 to 74 years",2014,0.114]
[null,"Portugal","Females","55 to 74 years",2015,0.10800000000000001]
[null,"Portugal","Females","55 to 74 years",2016,9.0999999999999998E-2]
[null,"Portugal","Females","55 to 74 years",2017,0.08]
[null,"Portugal","Females","55 to 74 years",2018,6.5000000000000002E-2]
[null,"Portugal","Females","55 to 74 years",2019,6.0999999999999999E-2]
[null,"Portugal","Females","55 to 74 years",2020,4.9000000000000002E-2]
[null,"Portugal","Females","55 to 74 years",2021,4.7E-2]
[null,"Portugal","Females","55 to 74 years",2022,5.2999999999999999E-2]
[null,"Portugal","Females","55 to 74 years",2023,5.5999999999999994E-2]
[null,"Portugal","Females","55 to 74 years",2024,5.2999999999999999E-2]
[null,"Romania","Females","55 to 74 years",2010,3.2000000000000001E-2]
[null,"Romania","Females","55 to 74 years",2011,2.7999999999999997E-2]
[null,"Romania","Females","55 to 74 years",2012,3.2000000000000001E-2]
[null,"Romania","Females","55 to 74 years",2013,3.7999999999999999E-2]
[null,"Romania","Females","55 to 74 years",2014,3.5000000000000003E-2]
[null,"Romania","Females","55 to 74 years",2015,3.3000000000000002E-2]
[null,"Romania","Females","55 to 74 years",2016,3.1E-2]
[null,"Romania","Females","55 to 74 years",2017,3.1E-2]
[null,"Romania","Females","55 to 74 years",2018,2.6000000000000002E-2]
[null,"Romania","Females","55 to 74 years",2019,2.7999999999999997E-2]
[null,"Romania","Females","55 to 74 years",2020,4.0999999999999995E-2]
[null,"Romania","Females","55 to 74 years",2021,3.3000000000000002E-2]
[null,"Romania","Females","55 to 74 years",2022,0.03]
[null,"Romania","Females","55 to 74 years",2023,3.7000000000000005E-2]
[null,"Romania","Females","55 to 74 years",2024,2.5000000000000001E-2]
[null,"Slovakia","Females","55 to 74 years",2010,0.109]
[null,"Slovakia","Females","55 to 74 years",2011,0.09]
[null,"Slovakia","Females","55 to 74 years",2012,0.115]
[null,"Slovakia","Females","55 to 74 years",2013,0.115]
[null,"Slovakia","Females","55 to 74 years",2014,0.11599999999999999]
[null,"Slovakia","Females","55 to 74 years",2015,0.10400000000000001]
[null,"Slovakia","Females","55 to 74 years",2016,9.5000000000000001E-2]
[null,"Slovakia","Females","55 to 74 years",2017,6.2E-2]
[null,"Slovakia","Females","55 to 74 years",2018,5.7999999999999996E-2]
[null,"Slovakia","Females","55 to 74 years",2019,0.05]
[null,"Slovakia","Females","55 to 74 years",2020,5.0999999999999997E-2]
[null,"Slovakia","Females","55 to 74 years",2021,5.2999999999999999E-2]
[null,"Slovakia","Females","55 to 74 years",2022,4.4999999999999998E-2]
[null,"Slovakia","Females","55 to 74 years",2023,3.9E-2]
[null,"Slovakia","Females","55 to 74 years",2024,3.5000000000000003E-2]
[null,"Slovenia","Females","55 to 74 years",2010,2.8999999999999998E-2]
[null,"Slovenia","Females","55 to 74 years",2011,3.3000000000000002E-2]
[null,"Slovenia","Females","55 to 74 years",2012,4.7E-2]
[null,"Slovenia","Females","55 to 74 years",2013,5.5E-2]
[null,"Slovenia","Females","55 to 74 years",2014,5.5999999999999994E-2]
[null,"Slovenia","Females","55 to 74 years",2015,6.5000000000000002E-2]
[null,"Slovenia","Females","55 to 74 years",2016,4.7E-2]
[null,"Slovenia","Females","55 to 74 years",2017,4.8000000000000001E-2]
[null,"Slovenia","Females","55 to 74 years",2018,4.0999999999999995E-2]
[null,"Slovenia","Females","55 to 74 years",2019,4.2000000000000003E-2]
[null,"Slovenia","Females","55 to 74 years",2020,3.7999999999999999E-2]
[null,"Slovenia","Females","55 to 74 years",2021,0.04]
[null,"Slovenia","Females","55 to 74 years",2022,3.6000000000000004E-2]
[null,"Slovenia","Females","55 to 74 years",2023,3.9E-2]
[null,"Slovenia","Females","55 to 74 years",2024,3.2000000000000001E-2]
[null,"Spain","Females","55 to 74 years",2010,0.13200000000000001]
[null,"Spain","Females","55 to 74 years",2011,0.14099999999999999]
[null,"Spain","Females","55 to 74 years",2012,0.17199999999999999]
[null,"Spain","Females","55 to 74 years",2013,0.191]
[null,"Spain","Females","55 to 74 years",2014,0.18899999999999997]
[null,"Spain","Females","55 to 74 years",2015,0.18100000000000002]
[null,"Spain","Females","55 to 74 years",2016,0.16800000000000001]
[null,"Spain","Females","55 to 74 years",2017,0.154]
[null,"Spain","Females","55 to 74 years",2018,0.14599999999999999]
[null,"Spain","Females","55 to 74 years",2019,0.13500000000000001]
[null,"Spain","Females","55 to 74 years",2020,0.13400000000000001]
[null,"Spain","Females","55 to 74 years",2021,0.14800000000000002]
[null,"Spain","Females","55 to 74 years",2022,0.13]
[null,"Spain","Females","55 to 74 years",2023,0.129]
[null,"Spain","Females","55 to 74 years",2024,0.11900000000000001]
[null,"Sweden","Females","55 to 74 years",2010,4.7E-2]
[null,"Sweden","Females","55 to 74 years",2011,4.4000000000000004E-2]
[null,"Sweden","Females","55 to 74 years",2012,4.5999999999999999E-2]
[null,"Sweden","Females","55 to 74 years",2013,4.0999999999999995E-2]
[null,"Sweden","Females","55 to 74 years",2014,4.4999999999999998E-2]
[null,"Sweden","Females","55 to 74 years",2015,4.4000000000000004E-2]
[null,"Sweden","Females","55 to 74 years",2016,4.0999999999999995E-2]
[null,"Sweden","Females","55 to 74 years",2017,4.2999999999999997E-2]
[null,"Sweden","Females","55 to 74 years",2018,3.7000000000000005E-2]
[null,"Sweden","Females","55 to 74 years",2019,0.04]
[null,"Sweden","Females","55 to 74 years",2020,4.8000000000000001E-2]
[null,"Sweden","Females","55 to 74 years",2021,5.7999999999999996E-2]
[null,"Sweden","Females","55 to 74 years",2022,4.9000000000000002E-2]
[null,"Sweden","Females","55 to 74 years",2023,5.0999999999999997E-2]
[null,"Sweden","Females","55 to 74 years",2024,5.4000000000000006E-2]
[null,"Austria","Males","15 to 24 years",2010,0.10400000000000001]
[null,"Austria","Males","15 to 24 years",2011,9.5000000000000001E-2]
[null,"Austria","Males","15 to 24 years",2012,0.10300000000000001]
[null,"Austria","Males","15 to 24 years",2013,0.10199999999999999]
[null,"Austria","Males","15 to 24 years",2014,0.115]
[null,"Austria","Males","15 to 24 years",2015,0.12]
[null,"Austria","Males","15 to 24 years",2016,0.13100000000000001]
[null,"Austria","Males","15 to 24 years",2017,0.11699999999999999]
[null,"Austria","Males","15 to 24 years",2018,0.10300000000000001]
[null,"Austria","Males","15 to 24 years",2019,0.1]
[null,"Austria","Males","15 to 24 years",2020,0.125]
[null,"Austria","Males","15 to 24 years",2021,0.107]
[null,"Austria","Males","15 to 24 years",2022,9.5000000000000001E-2]
[null,"Austria","Males","15 to 24 years",2023,0.10199999999999999]
[null,"Austria","Males","15 to 24 years",2024,0.10400000000000001]
[null,"Belgium","Males","15 to 24 years",2010,0.22399999999999998]
[null,"Belgium","Males","15 to 24 years",2011,0.18899999999999997]
[null,"Belgium","Males","15 to 24 years",2012,0.20699999999999999]
[null,"Belgium","Males","15 to 24 years",2013,0.25]
[null,"Belgium","Males","15 to 24 years",2014,0.24199999999999999]
[null,"Belgium","Males","15 to 24 years",2015,0.24100000000000002]
[null,"Belgium","Males","15 to 24 years",2016,0.21899999999999997]
[null,"Belgium","Males","15 to 24 years",2017,0.20300000000000001]
[null,"Belgium","Males","15 to 24 years",2018,0.16500000000000001]
[null,"Belgium","Males","15 to 24 years",2019,0.16300000000000001]
[null,"Belgium","Males","15 to 24 years",2020,0.161]
[null,"Belgium","Males","15 to 24 years",2021,0.19899999999999998]
[null,"Belgium","Males","15 to 24 years",2022,0.18100000000000002]
[null,"Belgium","Males","15 to 24 years",2023,0.17600000000000002]
[null,"Belgium","Males","15 to 24 years",2024,0.19600000000000001]
[null,"Bulgaria","Males","15 to 24 years",2010,0.255]
[null,"Bulgaria","Males","15 to 24 years",2011,0.28199999999999997]
[null,"Bulgaria","Males","15 to 24 years",2012,0.315]
[null,"Bulgaria","Males","15 to 24 years",2013,0.32200000000000001]
[null,"Bulgaria","Males","15 to 24 years",2014,0.26100000000000001]
[null,"Bulgaria","Males","15 to 24 years",2015,0.23600000000000002]
[null,"Bulgaria","Males","15 to 24 years",2016,0.2]
[null,"Bulgaria","Males","15 to 24 years",2017,0.16]
[null,"Bulgaria","Males","15 to 24 years",2018,0.16]
[null,"Bulgaria","Males","15 to 24 years",2019,0.12300000000000001]
[null,"Bulgaria","Males","15 to 24 years",2020,0.17300000000000001]
[null,"Bulgaria","Males","15 to 24 years",2021,0.16200000000000001]
[null,"Bulgaria","Males","15 to 24 years",2022,0.10800000000000001]
[null,"Bulgaria","Males","15 to 24 years",2023,0.128]
[null,"Bulgaria","Males","15 to 24 years",2024,0.128]
[null,"Croatia","Males","15 to 24 years",2010,0.315]
[null,"Croatia","Males","15 to 24 years",2011,0.37]
[null,"Croatia","Males","15 to 24 years",2012,0.42599999999999999]
[null,"Croatia","Males","15 to 24 years",2013,0.501]
[null,"Croatia","Males","15 to 24 years",2014,0.45100000000000001]
[null,"Croatia","Males","15 to 24 years",2015,0.41499999999999998]
[null,"Croatia","Males","15 to 24 years",2016,0.309]
[null,"Croatia","Males","15 to 24 years",2017,0.27500000000000002]
[null,"Croatia","Males","15 to 24 years",2018,0.193]
[null,"Croatia","Males","15 to 24 years",2019,0.153]
[null,"Croatia","Males","15 to 24 years",2020,0.18600000000000003]
[null,"Croatia","Males","15 to 24 years",2021,0.183]
[null,"Croatia","Males","15 to 24 years",2022,0.14699999999999999]
[null,"Croatia","Males","15 to 24 years",2023,0.17100000000000001]
[null,"Croatia","Males","15 to 24 years",2024,0.159]
[null,"Cyprus","Males","15 to 24 years",2010,0.159]
[null,"Cyprus","Males","15 to 24 years",2011,0.23300000000000001]
[null,"Cyprus","Males","15 to 24 years",2012,0.28800000000000003]
[null,"Cyprus","Males","15 to 24 years",2013,0.41100000000000003]
[null,"Cyprus","Males","15 to 24 years",2014,0.374]
[null,"Cyprus","Males","15 to 24 years",2015,0.34700000000000003]
[null,"Cyprus","Males","15 to 24 years",2016,0.25800000000000001]
[null,"Cyprus","Males","15 to 24 years",2017,0.27]
[null,"Cyprus","Males","15 to 24 years",2018,0.25]
[null,"Cyprus","Males","15 to 24 years",2019,0.20100000000000001]
[null,"Cyprus","Males","15 to 24 years",2020,0.22500000000000001]
[null,"Cyprus","Males","15 to 24 years",2021,0.184]
[null,"Cyprus","Males","15 to 24 years",2022,0.183]
[null,"Cyprus","Males","15 to 24 years",2023,0.183]
[null,"Cyprus","Males","15 to 24 years",2024,0.124]
[null,"Czechia","Males","15 to 24 years",2010,0.182]
[null,"Czechia","Males","15 to 24 years",2011,0.18100000000000002]
[null,"Czechia","Males","15 to 24 years",2012,0.19899999999999998]
[null,"Czechia","Males","15 to 24 years",2013,0.18600000000000003]
[null,"Czechia","Males","15 to 24 years",2014,0.15]
[null,"Czechia","Males","15 to 24 years",2015,0.113]
[null,"Czechia","Males","15 to 24 years",2016,9.9000000000000005E-2]
[null,"Czechia","Males","15 to 24 years",2017,7.400000000000001E-2]
[null,"Czechia","Males","15 to 24 years",2018,6.4000000000000001E-2]
[null,"Czechia","Males","15 to 24 years",2019,5.4000000000000006E-2]
[null,"Czechia","Males","15 to 24 years",2020,7.2000000000000008E-2]
[null,"Czechia","Males","15 to 24 years",2021,7.5999999999999998E-2]
[null,"Czechia","Males","15 to 24 years",2022,0.06]
[null,"Czechia","Males","15 to 24 years",2023,7.9000000000000001E-2]
[null,"Czechia","Males","15 to 24 years",2024,8.5999999999999993E-2]
[null,"Denmark","Males","15 to 24 years",2010,0.17899999999999999]
[null,"Denmark","Males","15 to 24 years",2011,0.182]
[null,"Denmark","Males","15 to 24 years",2012,0.16800000000000001]
[null,"Denmark","Males","15 to 24 years",2013,0.16300000000000001]
[null,"Denmark","Males","15 to 24 years",2014,0.156]
[null,"Denmark","Males","15 to 24 years",2015,0.13200000000000001]
[null,"Denmark","Males","15 to 24 years",2016,0.13500000000000001]
[null,"Denmark","Males","15 to 24 years",2017,0.129]
[null,"Denmark","Males","15 to 24 years",2018,0.11800000000000001]
[null,"Denmark","Males","15 to 24 years",2019,0.10400000000000001]
[null,"Denmark","Males","15 to 24 years",2020,0.126]
[null,"Denmark","Males","15 to 24 years",2021,0.107]
[null,"Denmark","Males","15 to 24 years",2022,0.106]
[null,"Denmark","Males","15 to 24 years",2023,0.11800000000000001]
[null,"Denmark","Males","15 to 24 years",2024,0.15]
[null,"Estonia","Males","15 to 24 years",2010,0.35700000000000004]
[null,"Estonia","Males","15 to 24 years",2011,0.23800000000000002]
[null,"Estonia","Males","15 to 24 years",2012,0.22800000000000001]
[null,"Estonia","Males","15 to 24 years",2013,0.17800000000000002]
[null,"Estonia","Males","15 to 24 years",2014,0.193]
[null,"Estonia","Males","15 to 24 years",2015,0.155]
[null,"Estonia","Males","15 to 24 years",2016,0.17300000000000001]
[null,"Estonia","Males","15 to 24 years",2017,0.14699999999999999]
[null,"Estonia","Males","15 to 24 years",2018,0.129]
[null,"Estonia","Males","15 to 24 years",2019,0.11199999999999999]
[null,"Estonia","Males","15 to 24 years",2020,0.184]
[null,"Estonia","Males","15 to 24 years",2021,0.184]
[null,"Estonia","Males","15 to 24 years",2022,0.21]
[null,"Estonia","Males","15 to 24 years",2023,0.184]
[null,"Estonia","Males","15 to 24 years",2024,0.18899999999999997]
[null,"Finland","Males","15 to 24 years",2010,0.24399999999999999]
[null,"Finland","Males","15 to 24 years",2011,0.222]
[null,"Finland","Males","15 to 24 years",2012,0.20800000000000002]
[null,"Finland","Males","15 to 24 years",2013,0.23899999999999999]
[null,"Finland","Males","15 to 24 years",2014,0.23199999999999998]
[null,"Finland","Males","15 to 24 years",2015,0.26]
[null,"Finland","Males","15 to 24 years",2016,0.221]
[null,"Finland","Males","15 to 24 years",2017,0.20800000000000002]
[null,"Finland","Males","15 to 24 years",2018,0.17699999999999999]
[null,"Finland","Males","15 to 24 years",2019,0.19500000000000001]
[null,"Finland","Males","15 to 24 years",2020,0.22800000000000001]
[null,"Finland","Males","15 to 24 years",2021,0.17800000000000002]
[null,"Finland","Males","15 to 24 years",2022,0.14400000000000002]
[null,"Finland","Males","15 to 24 years",2023,0.16899999999999998]
[null,"Finland","Males","15 to 24 years",2024,0.19600000000000001]
[null,"France","Males","15 to 24 years",2010,0.222]
[null,"France","Males","15 to 24 years",2011,0.214]
[null,"France","Males","15 to 24 years",2012,0.24100000000000002]
[null,"France","Males","15 to 24 years",2013,0.23800000000000002]
[null,"France","Males","15 to 24 years",2014,0.24399999999999999]
[null,"France","Males","15 to 24 years",2015,0.251]
[null,"France","Males","15 to 24 years",2016,0.24199999999999999]
[null,"France","Males","15 to 24 years",2017,0.223]
[null,"France","Males","15 to 24 years",2018,0.20800000000000002]
[null,"France","Males","15 to 24 years",2019,0.2]
[null,"France","Males","15 to 24 years",2020,0.19800000000000001]
[null,"France","Males","15 to 24 years",2021,0.19]
[null,"France","Males","15 to 24 years",2022,0.185]
[null,"France","Males","15 to 24 years",2023,0.182]
[null,"France","Males","15 to 24 years",2024,0.19]
[null,"Germany","Males","15 to 24 years",2010,0.114]
[null,"Germany","Males","15 to 24 years",2011,9.6999999999999989E-2]
[null,"Germany","Males","15 to 24 years",2012,9.1999999999999998E-2]
[null,"Germany","Males","15 to 24 years",2013,0.09]
[null,"Germany","Males","15 to 24 years",2014,8.8000000000000009E-2]
[null,"Germany","Males","15 to 24 years",2015,8.3000000000000004E-2]
[null,"Germany","Males","15 to 24 years",2016,8.3000000000000004E-2]
[null,"Germany","Males","15 to 24 years",2017,0.08]
[null,"Germany","Males","15 to 24 years",2018,7.4999999999999997E-2]
[null,"Germany","Males","15 to 24 years",2019,6.9000000000000006E-2]
[null,"Germany","Males","15 to 24 years",2020,8.4000000000000005E-2]
[null,"Germany","Males","15 to 24 years",2021,7.400000000000001E-2]
[null,"Germany","Males","15 to 24 years",2022,6.4000000000000001E-2]
[null,"Germany","Males","15 to 24 years",2023,6.5000000000000002E-2]
[null,"Germany","Males","15 to 24 years",2024,7.0999999999999994E-2]
[null,"Greece","Males","15 to 24 years",2010,0.27600000000000002]
[null,"Greece","Males","15 to 24 years",2011,0.39399999999999996]
[null,"Greece","Males","15 to 24 years",2012,0.49399999999999999]
[null,"Greece","Males","15 to 24 years",2013,0.54899999999999993]
[null,"Greece","Males","15 to 24 years",2014,0.48100000000000004]
[null,"Greece","Males","15 to 24 years",2015,0.46500000000000002]
[null,"Greece","Males","15 to 24 years",2016,0.44799999999999995]
[null,"Greece","Males","15 to 24 years",2017,0.40500000000000003]
[null,"Greece","Males","15 to 24 years",2018,0.377]
[null,"Greece","Males","15 to 24 years",2019,0.34499999999999997]
[null,"Greece","Males","15 to 24 years",2020,0.34200000000000003]
[null,"Greece","Males","15 to 24 years",2021,0.311]
[null,"Greece","Males","15 to 24 years",2022,0.251]
[null,"Greece","Males","15 to 24 years",2023,0.24399999999999999]
[null,"Greece","Males","15 to 24 years",2024,0.21100000000000002]
[null,"Hungary","Males","15 to 24 years",2010,0.27699999999999997]
[null,"Hungary","Males","15 to 24 years",2011,0.27]
[null,"Hungary","Males","15 to 24 years",2012,0.29100000000000004]
[null,"Hungary","Males","15 to 24 years",2013,0.25600000000000001]
[null,"Hungary","Males","15 to 24 years",2014,0.2]
[null,"Hungary","Males","15 to 24 years",2015,0.183]
[null,"Hungary","Males","15 to 24 years",2016,0.129]
[null,"Hungary","Males","15 to 24 years",2017,9.6999999999999989E-2]
[null,"Hungary","Males","15 to 24 years",2018,9.8000000000000004E-2]
[null,"Hungary","Males","15 to 24 years",2019,0.11900000000000001]
[null,"Hungary","Males","15 to 24 years",2020,0.121]
[null,"Hungary","Males","15 to 24 years",2021,0.122]
[null,"Hungary","Males","15 to 24 years",2022,0.114]
[null,"Hungary","Males","15 to 24 years",2023,0.13200000000000001]
[null,"Hungary","Males","15 to 24 years",2024,0.154]
[null,"Ireland","Males","15 to 24 years",2010,0.34700000000000003]
[null,"Ireland","Males","15 to 24 years",2011,0.36099999999999999]
[null,"Ireland","Males","15 to 24 years",2012,0.374]
[null,"Ireland","Males","15 to 24 years",2013,0.30299999999999999]
[null,"Ireland","Males","15 to 24 years",2014,0.26600000000000001]
[null,"Ireland","Males","15 to 24 years",2015,0.23499999999999999]
[null,"Ireland","Males","15 to 24 years",2016,0.19699999999999998]
[null,"Ireland","Males","15 to 24 years",2017,0.16]
[null,"Ireland","Males","15 to 24 years",2018,0.14800000000000002]
[null,"Ireland","Males","15 to 24 years",2019,0.14199999999999999]
[null,"Ireland","Males","15 to 24 years",2020,0.159]
[null,"Ireland","Males","15 to 24 years",2021,0.14499999999999999]
[null,"Ireland","Males","15 to 24 years",2022,0.10199999999999999]
[null,"Ireland","Males","15 to 24 years",2023,0.107]
[null,"Ireland","Males","15 to 24 years",2024,0.109]
[null,"Italy","Males","15 to 24 years",2010,0.27]
[null,"Italy","Males","15 to 24 years",2011,0.27100000000000002]
[null,"Italy","Males","15 to 24 years",2012,0.33799999999999997]
[null,"Italy","Males","15 to 24 years",2013,0.39]
[null,"Italy","Males","15 to 24 years",2014,0.41299999999999998]
[null,"Italy","Males","15 to 24 years",2015,0.38700000000000001]
[null,"Italy","Males","15 to 24 years",2016,0.36299999999999999]
[null,"Italy","Males","15 to 24 years",2017,0.32899999999999996]
[null,"Italy","Males","15 to 24 years",2018,0.30399999999999999]
[null,"Italy","Males","15 to 24 years",2019,0.27800000000000002]
[null,"Italy","Males","15 to 24 years",2020,0.28399999999999997]
[null,"Italy","Males","15 to 24 years",2021,0.27699999999999997]
[null,"Italy","Males","15 to 24 years",2022,0.223]
[null,"Italy","Males","15 to 24 years",2023,0.21100000000000002]
[null,"Italy","Males","15 to 24 years",2024,0.192]
[null,"Latvia","Males","15 to 24 years",2010,0.373]
[null,"Latvia","Males","15 to 24 years",2011,0.313]
[null,"Latvia","Males","15 to 24 years",2012,0.27800000000000002]
[null,"Latvia","Males","15 to 24 years",2013,0.21899999999999997]
[null,"Latvia","Males","15 to 24 years",2014,0.19399999999999998]
[null,"Latvia","Males","15 to 24 years",2015,0.18]
[null,"Latvia","Males","15 to 24 years",2016,0.215]
[null,"Latvia","Males","15 to 24 years",2017,0.183]
[null,"Latvia","Males","15 to 24 years",2018,0.125]
[null,"Latvia","Males","15 to 24 years",2019,0.14699999999999999]
[null,"Latvia","Males","15 to 24 years",2020,0.14400000000000002]
[null,"Latvia","Males","15 to 24 years",2021,0.14899999999999999]
[null,"Latvia","Males","15 to 24 years",2022,0.19399999999999998]
[null,"Latvia","Males","15 to 24 years",2023,0.14300000000000002]
[null,"Latvia","Males","15 to 24 years",2024,0.13200000000000001]
[null,"Lithuania","Males","15 to 24 years",2010,0.39]
[null,"Lithuania","Males","15 to 24 years",2011,0.34899999999999998]
[null,"Lithuania","Males","15 to 24 years",2012,0.29699999999999999]
[null,"Lithuania","Males","15 to 24 years",2013,0.23]
[null,"Lithuania","Males","15 to 24 years",2014,0.19600000000000001]
[null,"Lithuania","Males","15 to 24 years",2015,0.16]
[null,"Lithuania","Males","15 to 24 years",2016,0.159]
[null,"Lithuania","Males","15 to 24 years",2017,0.14599999999999999]
[null,"Lithuania","Males","15 to 24 years",2018,0.12]
[null,"Lithuania","Males","15 to 24 years",2019,0.14099999999999999]
[null,"Lithuania","Males","15 to 24 years",2020,0.215]
[null,"Lithuania","Males","15 to 24 years",2021,0.14000000000000001]
[null,"Lithuania","Males","15 to 24 years",2022,0.13400000000000001]
[null,"Lithuania","Males","15 to 24 years",2023,0.17199999999999999]
[null,"Lithuania","Males","15 to 24 years",2024,0.16]
[null,"Luxembourg","Males","15 to 24 years",2010,0.17600000000000002]
[null,"Luxembourg","Males","15 to 24 years",2011,0.13300000000000001]
[null,"Luxembourg","Males","15 to 24 years",2012,0.18899999999999997]
[null,"Luxembourg","Males","15 to 24 years",2013,0.187]
[null,"Luxembourg","Males","15 to 24 years",2014,0.26100000000000001]
[null,"Luxembourg","Males","15 to 24 years",2015,0.18899999999999997]
[null,"Luxembourg","Males","15 to 24 years",2016,0.19699999999999998]
[null,"Luxembourg","Males","15 to 24 years",2017,0.17199999999999999]
[null,"Luxembourg","Males","15 to 24 years",2018,0.16300000000000001]
[null,"Luxembourg","Males","15 to 24 years",2019,0.17800000000000002]
[null,"Luxembourg","Males","15 to 24 years",2020,0.248]
[null,"Luxembourg","Males","15 to 24 years",2021,0.17699999999999999]
[null,"Luxembourg","Males","15 to 24 years",2022,0.16699999999999998]
[null,"Luxembourg","Males","15 to 24 years",2023,0.156]
[null,"Luxembourg","Males","15 to 24 years",2024,0.24399999999999999]
[null,"Malta","Males","15 to 24 years",2010,0.14400000000000002]
[null,"Malta","Males","15 to 24 years",2011,0.13699999999999998]
[null,"Malta","Males","15 to 24 years",2012,0.13300000000000001]
[null,"Malta","Males","15 to 24 years",2013,0.14699999999999999]
[null,"Malta","Males","15 to 24 years",2014,0.13699999999999998]
[null,"Malta","Males","15 to 24 years",2015,0.13200000000000001]
[null,"Malta","Males","15 to 24 years",2016,0.10199999999999999]
[null,"Malta","Males","15 to 24 years",2017,0.111]
[null,"Malta","Males","15 to 24 years",2018,0.11699999999999999]
[null,"Malta","Males","15 to 24 years",2019,0.113]
[null,"Malta","Males","15 to 24 years",2020,0.14099999999999999]
[null,"Malta","Males","15 to 24 years",2021,0.129]
[null,"Malta","Males","15 to 24 years",2022,0.11599999999999999]
[null,"Malta","Males","15 to 24 years",2023,0.11599999999999999]
[null,"Malta","Males","15 to 24 years",2024,9.6000000000000002E-2]
[null,"Netherlands","Males","15 to 24 years",2010,0.14099999999999999]
[null,"Netherlands","Males","15 to 24 years",2011,0.128]
[null,"Netherlands","Males","15 to 24 years",2012,0.13900000000000001]
[null,"Netherlands","Males","15 to 24 years",2013,0.154]
[null,"Netherlands","Males","15 to 24 years",2014,0.14400000000000002]
[null,"Netherlands","Males","15 to 24 years",2015,0.13500000000000001]
[null,"Netherlands","Males","15 to 24 years",2016,0.13500000000000001]
[null,"Netherlands","Males","15 to 24 years",2017,0.114]
[null,"Netherlands","Males","15 to 24 years",2018,0.10199999999999999]
[null,"Netherlands","Males","15 to 24 years",2019,9.6999999999999989E-2]
[null,"Netherlands","Males","15 to 24 years",2020,0.115]
[null,"Netherlands","Males","15 to 24 years",2021,9.6999999999999989E-2]
[null,"Netherlands","Males","15 to 24 years",2022,7.2999999999999995E-2]
[null,"Netherlands","Males","15 to 24 years",2023,8.3000000000000004E-2]
[null,"Netherlands","Males","15 to 24 years",2024,8.8000000000000009E-2]
[null,"Poland","Males","15 to 24 years",2010,0.22899999999999998]
[null,"Poland","Males","15 to 24 years",2011,0.24199999999999999]
[null,"Poland","Males","15 to 24 years",2012,0.245]
[null,"Poland","Males","15 to 24 years",2013,0.25800000000000001]
[null,"Poland","Males","15 to 24 years",2014,0.23100000000000001]
[null,"Poland","Males","15 to 24 years",2015,0.20899999999999999]
[null,"Poland","Males","15 to 24 years",2016,0.17699999999999999]
[null,"Poland","Males","15 to 24 years",2017,0.14800000000000002]
[null,"Poland","Males","15 to 24 years",2018,0.11599999999999999]
[null,"Poland","Males","15 to 24 years",2019,9.6000000000000002E-2]
[null,"Poland","Males","15 to 24 years",2020,0.10400000000000001]
[null,"Poland","Males","15 to 24 years",2021,0.11599999999999999]
[null,"Poland","Males","15 to 24 years",2022,0.105]
[null,"Poland","Males","15 to 24 years",2023,0.11599999999999999]
[null,"Poland","Males","15 to 24 years",2024,0.107]
[null,"Portugal","Males","15 to 24 years",2010,0.27300000000000002]
[null,"Portugal","Males","15 to 24 years",2011,0.29199999999999998]
[null,"Portugal","Males","15 to 24 years",2012,0.37200000000000005]
[null,"Portugal","Males","15 to 24 years",2013,0.373]
[null,"Portugal","Males","15 to 24 years",2014,0.34399999999999997]
[null,"Portugal","Males","15 to 24 years",2015,0.29699999999999999]
[null,"Portugal","Males","15 to 24 years",2016,0.27200000000000002]
[null,"Portugal","Males","15 to 24 years",2017,0.22399999999999998]
[null,"Portugal","Males","15 to 24 years",2018,0.20100000000000001]
[null,"Portugal","Males","15 to 24 years",2019,0.158]
[null,"Portugal","Males","15 to 24 years",2020,0.21100000000000002]
[null,"Portugal","Males","15 to 24 years",2021,0.20899999999999999]
[null,"Portugal","Males","15 to 24 years",2022,0.18100000000000002]
[null,"Portugal","Males","15 to 24 years",2023,0.20800000000000002]
[null,"Portugal","Males","15 to 24 years",2024,0.20899999999999999]
[null,"Romania","Males","15 to 24 years",2010,0.27899999999999997]
[null,"Romania","Males","15 to 24 years",2011,0.29299999999999998]
[null,"Romania","Males","15 to 24 years",2012,0.27600000000000002]
[null,"Romania","Males","15 to 24 years",2013,0.28699999999999998]
[null,"Romania","Males","15 to 24 years",2014,0.29399999999999998]
[null,"Romania","Males","15 to 24 years",2015,0.26]
[null,"Romania","Males","15 to 24 years",2016,0.25]
[null,"Romania","Males","15 to 24 years",2017,0.22899999999999998]
[null,"Romania","Males","15 to 24 years",2018,0.20399999999999999]
[null,"Romania","Males","15 to 24 years",2019,0.20399999999999999]
[null,"Romania","Males","15 to 24 years",2020,0.221]
[null,"Romania","Males","15 to 24 years",2021,0.20899999999999999]
[null,"Romania","Males","15 to 24 years",2022,0.21600000000000003]
[null,"Romania","Males","15 to 24 years",2023,0.215]
[null,"Romania","Males","15 to 24 years",2024,0.23199999999999998]
[null,"Slovakia","Males","15 to 24 years",2010,0.35]
[null,"Slovakia","Males","15 to 24 years",2011,0.33500000000000002]
[null,"Slovakia","Males","15 to 24 years",2012,0.35299999999999998]
[null,"Slovakia","Males","15 to 24 years",2013,0.35299999999999998]
[null,"Slovakia","Males","15 to 24 years",2014,0.29799999999999999]
[null,"Slovakia","Males","15 to 24 years",2015,0.26100000000000001]
[null,"Slovakia","Males","15 to 24 years",2016,0.2]
[null,"Slovakia","Males","15 to 24 years",2017,0.183]
[null,"Slovakia","Males","15 to 24 years",2018,0.14400000000000002]
[null,"Slovakia","Males","15 to 24 years",2019,0.14199999999999999]
[null,"Slovakia","Males","15 to 24 years",2020,0.185]
[null,"Slovakia","Males","15 to 24 years",2021,0.19800000000000001]
[null,"Slovakia","Males","15 to 24 years",2022,0.188]
[null,"Slovakia","Males","15 to 24 years",2023,0.221]
[null,"Slovakia","Males","15 to 24 years",2024,0.193]
[null,"Slovenia","Males","15 to 24 years",2010,0.154]
[null,"Slovenia","Males","15 to 24 years",2011,0.151]
[null,"Slovenia","Males","15 to 24 years",2012,0.20399999999999999]
[null,"Slovenia","Males","15 to 24 years",2013,0.20100000000000001]
[null,"Slovenia","Males","15 to 24 years",2014,0.19600000000000001]
[null,"Slovenia","Males","15 to 24 years",2015,0.17699999999999999]
[null,"Slovenia","Males","15 to 24 years",2016,0.158]
[null,"Slovenia","Males","15 to 24 years",2017,0.1]
[null,"Slovenia","Males","15 to 24 years",2018,8.3000000000000004E-2]
[null,"Slovenia","Males","15 to 24 years",2019,7.400000000000001E-2]
[null,"Slovenia","Males","15 to 24 years",2020,0.13]
[null,"Slovenia","Males","15 to 24 years",2021,0.115]
[null,"Slovenia","Males","15 to 24 years",2022,8.5999999999999993E-2]
[null,"Slovenia","Males","15 to 24 years",2023,0.106]
[null,"Slovenia","Males","15 to 24 years",2024,0.11]
[null,"Spain","Males","15 to 24 years",2010,0.43099999999999999]
[null,"Spain","Males","15 to 24 years",2011,0.48200000000000004]
[null,"Spain","Males","15 to 24 years",2012,0.54100000000000004]
[null,"Spain","Males","15 to 24 years",2013,0.56200000000000006]
[null,"Spain","Males","15 to 24 years",2014,0.53400000000000003]
[null,"Spain","Males","15 to 24 years",2015,0.48599999999999999]
[null,"Spain","Males","15 to 24 years",2016,0.44]
[null,"Spain","Males","15 to 24 years",2017,0.39500000000000002]
[null,"Spain","Males","15 to 24 years",2018,0.35200000000000004]
[null,"Spain","Males","15 to 24 years",2019,0.309]
[null,"Spain","Males","15 to 24 years",2020,0.371]
[null,"Spain","Males","15 to 24 years",2021,0.34]
[null,"Spain","Males","15 to 24 years",2022,0.28699999999999998]
[null,"Spain","Males","15 to 24 years",2023,0.28800000000000003]
[null,"Spain","Males","15 to 24 years",2024,0.26]
[null,"Sweden","Males","15 to 24 years",2010,0.25]
[null,"Sweden","Males","15 to 24 years",2011,0.22399999999999998]
[null,"Sweden","Males","15 to 24 years",2012,0.24100000000000002]
[null,"Sweden","Males","15 to 24 years",2013,0.23899999999999999]
[null,"Sweden","Males","15 to 24 years",2014,0.23499999999999999]
[null,"Sweden","Males","15 to 24 years",2015,0.20399999999999999]
[null,"Sweden","Males","15 to 24 years",2016,0.19699999999999998]
[null,"Sweden","Males","15 to 24 years",2017,0.17800000000000002]
[null,"Sweden","Males","15 to 24 years",2018,0.17600000000000002]
[null,"Sweden","Males","15 to 24 years",2019,0.19600000000000001]
[null,"Sweden","Males","15 to 24 years",2020,0.245]
[null,"Sweden","Males","15 to 24 years",2021,0.252]
[null,"Sweden","Males","15 to 24 years",2022,0.20199999999999999]
[null,"Sweden","Males","15 to 24 years",2023,0.22500000000000001]
[null,"Sweden","Males","15 to 24 years",2024,0.249]
[null,"Austria","Males","15 to 29 years",2010,8.8000000000000009E-2]
[null,"Austria","Males","15 to 29 years",2011,8.1000000000000003E-2]
[null,"Austria","Males","15 to 29 years",2012,8.8000000000000009E-2]
[null,"Austria","Males","15 to 29 years",2013,9.3000000000000013E-2]
[null,"Austria","Males","15 to 29 years",2014,0.10099999999999999]
[null,"Austria","Males","15 to 29 years",2015,0.10199999999999999]
[null,"Austria","Males","15 to 29 years",2016,0.113]
[null,"Austria","Males","15 to 29 years",2017,0.1]
[null,"Austria","Males","15 to 29 years",2018,8.4000000000000005E-2]
[null,"Austria","Males","15 to 29 years",2019,7.8E-2]
[null,"Austria","Males","15 to 29 years",2020,0.10199999999999999]
[null,"Austria","Males","15 to 29 years",2021,8.6999999999999994E-2]
[null,"Austria","Males","15 to 29 years",2022,7.8E-2]
[null,"Austria","Males","15 to 29 years",2023,8.199999999999999E-2]
[null,"Austria","Males","15 to 29 years",2024,8.900000000000001E-2]
[null,"Belgium","Males","15 to 29 years",2010,0.16500000000000001]
[null,"Belgium","Males","15 to 29 years",2011,0.13900000000000001]
[null,"Belgium","Males","15 to 29 years",2012,0.15]
[null,"Belgium","Males","15 to 29 years",2013,0.17499999999999999]
[null,"Belgium","Males","15 to 29 years",2014,0.18]
[null,"Belgium","Males","15 to 29 years",2015,0.17499999999999999]
[null,"Belgium","Males","15 to 29 years",2016,0.154]
[null,"Belgium","Males","15 to 29 years",2017,0.14300000000000002]
[null,"Belgium","Males","15 to 29 years",2018,0.11199999999999999]
[null,"Belgium","Males","15 to 29 years",2019,0.11]
[null,"Belgium","Males","15 to 29 years",2020,0.114]
[null,"Belgium","Males","15 to 29 years",2021,0.13900000000000001]
[null,"Belgium","Males","15 to 29 years",2022,0.127]
[null,"Belgium","Males","15 to 29 years",2023,0.129]
[null,"Belgium","Males","15 to 29 years",2024,0.14499999999999999]
[null,"Bulgaria","Males","15 to 29 years",2010,0.19699999999999998]
[null,"Bulgaria","Males","15 to 29 years",2011,0.215]
[null,"Bulgaria","Males","15 to 29 years",2012,0.23699999999999999]
[null,"Bulgaria","Males","15 to 29 years",2013,0.23899999999999999]
[null,"Bulgaria","Males","15 to 29 years",2014,0.19500000000000001]
[null,"Bulgaria","Males","15 to 29 years",2015,0.16500000000000001]
[null,"Bulgaria","Males","15 to 29 years",2016,0.15]
[null,"Bulgaria","Males","15 to 29 years",2017,0.12]
[null,"Bulgaria","Males","15 to 29 years",2018,0.11]
[null,"Bulgaria","Males","15 to 29 years",2019,9.4E-2]
[null,"Bulgaria","Males","15 to 29 years",2020,0.111]
[null,"Bulgaria","Males","15 to 29 years",2021,0.11]
[null,"Bulgaria","Males","15 to 29 years",2022,8.5999999999999993E-2]
[null,"Bulgaria","Males","15 to 29 years",2023,8.5000000000000006E-2]
[null,"Bulgaria","Males","15 to 29 years",2024,8.199999999999999E-2]
[null,"Croatia","Males","15 to 29 years",2010,0.23800000000000002]
[null,"Croatia","Males","15 to 29 years",2011,0.28300000000000003]
[null,"Croatia","Males","15 to 29 years",2012,0.32600000000000001]
[null,"Croatia","Males","15 to 29 years",2013,0.35299999999999998]
[null,"Croatia","Males","15 to 29 years",2014,0.32200000000000001]
[null,"Croatia","Males","15 to 29 years",2015,0.28600000000000003]
[null,"Croatia","Males","15 to 29 years",2016,0.23800000000000002]
[null,"Croatia","Males","15 to 29 years",2017,0.21199999999999999]
[null,"Croatia","Males","15 to 29 years",2018,0.14599999999999999]
[null,"Croatia","Males","15 to 29 years",2019,0.109]
[null,"Croatia","Males","15 to 29 years",2020,0.14199999999999999]
[null,"Croatia","Males","15 to 29 years",2021,0.14400000000000002]
[null,"Croatia","Males","15 to 29 years",2022,9.6999999999999989E-2]
[null,"Croatia","Males","15 to 29 years",2023,0.114]
[null,"Croatia","Males","15 to 29 years",2024,0.126]
[null,"Cyprus","Males","15 to 29 years",2010,0.125]
[null,"Cyprus","Males","15 to 29 years",2011,0.159]
[null,"Cyprus","Males","15 to 29 years",2012,0.21299999999999999]
[null,"Cyprus","Males","15 to 29 years",2013,0.29399999999999998]
[null,"Cyprus","Males","15 to 29 years",2014,0.27800000000000002]
[null,"Cyprus","Males","15 to 29 years",2015,0.24600000000000002]
[null,"Cyprus","Males","15 to 29 years",2016,0.20699999999999999]
[null,"Cyprus","Males","15 to 29 years",2017,0.188]
[null,"Cyprus","Males","15 to 29 years",2018,0.16200000000000001]
[null,"Cyprus","Males","15 to 29 years",2019,0.121]
[null,"Cyprus","Males","15 to 29 years",2020,0.15]
[null,"Cyprus","Males","15 to 29 years",2021,0.155]
[null,"Cyprus","Males","15 to 29 years",2022,0.13200000000000001]
[null,"Cyprus","Males","15 to 29 years",2023,0.13100000000000001]
[null,"Cyprus","Males","15 to 29 years",2024,0.115]
[null,"Czechia","Males","15 to 29 years",2010,0.126]
[null,"Czechia","Males","15 to 29 years",2011,0.113]
[null,"Czechia","Males","15 to 29 years",2012,0.128]
[null,"Czechia","Males","15 to 29 years",2013,0.121]
[null,"Czechia","Males","15 to 29 years",2014,0.1]
[null,"Czechia","Males","15 to 29 years",2015,8.199999999999999E-2]
[null,"Czechia","Males","15 to 29 years",2016,6.3E-2]
[null,"Czechia","Males","15 to 29 years",2017,4.4999999999999998E-2]
[null,"Czechia","Males","15 to 29 years",2018,3.9E-2]
[null,"Czechia","Males","15 to 29 years",2019,3.3000000000000002E-2]
[null,"Czechia","Males","15 to 29 years",2020,4.4999999999999998E-2]
[null,"Czechia","Males","15 to 29 years",2021,4.4999999999999998E-2]
[null,"Czechia","Males","15 to 29 years",2022,3.5000000000000003E-2]
[null,"Czechia","Males","15 to 29 years",2023,4.4999999999999998E-2]
[null,"Czechia","Males","15 to 29 years",2024,5.2999999999999999E-2]
[null,"Denmark","Males","15 to 29 years",2010,0.158]
[null,"Denmark","Males","15 to 29 years",2011,0.152]
[null,"Denmark","Males","15 to 29 years",2012,0.14800000000000002]
[null,"Denmark","Males","15 to 29 years",2013,0.13400000000000001]
[null,"Denmark","Males","15 to 29 years",2014,0.13100000000000001]
[null,"Denmark","Males","15 to 29 years",2015,0.11199999999999999]
[null,"Denmark","Males","15 to 29 years",2016,0.113]
[null,"Denmark","Males","15 to 29 years",2017,0.114]
[null,"Denmark","Males","15 to 29 years",2018,0.10400000000000001]
[null,"Denmark","Males","15 to 29 years",2019,9.8000000000000004E-2]
[null,"Denmark","Males","15 to 29 years",2020,0.11199999999999999]
[null,"Denmark","Males","15 to 29 years",2021,9.5000000000000001E-2]
[null,"Denmark","Males","15 to 29 years",2022,8.5999999999999993E-2]
[null,"Denmark","Males","15 to 29 years",2023,9.9000000000000005E-2]
[null,"Denmark","Males","15 to 29 years",2024,0.11800000000000001]
[null,"Estonia","Males","15 to 29 years",2010,0.26100000000000001]
[null,"Estonia","Males","15 to 29 years",2011,0.18100000000000002]
[null,"Estonia","Males","15 to 29 years",2012,0.157]
[null,"Estonia","Males","15 to 29 years",2013,0.13300000000000001]
[null,"Estonia","Males","15 to 29 years",2014,0.129]
[null,"Estonia","Males","15 to 29 years",2015,9.4E-2]
[null,"Estonia","Males","15 to 29 years",2016,0.11599999999999999]
[null,"Estonia","Males","15 to 29 years",2017,8.5999999999999993E-2]
[null,"Estonia","Males","15 to 29 years",2018,7.5999999999999998E-2]
[null,"Estonia","Males","15 to 29 years",2019,6.5000000000000002E-2]
[null,"Estonia","Males","15 to 29 years",2020,0.11599999999999999]
[null,"Estonia","Males","15 to 29 years",2021,0.114]
[null,"Estonia","Males","15 to 29 years",2022,0.11900000000000001]
[null,"Estonia","Males","15 to 29 years",2023,0.113]
[null,"Estonia","Males","15 to 29 years",2024,0.14099999999999999]
[null,"Finland","Males","15 to 29 years",2010,0.17300000000000001]
[null,"Finland","Males","15 to 29 years",2011,0.161]
[null,"Finland","Males","15 to 29 years",2012,0.155]
[null,"Finland","Males","15 to 29 years",2013,0.16899999999999998]
[null,"Finland","Males","15 to 29 years",2014,0.17499999999999999]
[null,"Finland","Males","15 to 29 years",2015,0.19]
[null,"Finland","Males","15 to 29 years",2016,0.16899999999999998]
[null,"Finland","Males","15 to 29 years",2017,0.158]
[null,"Finland","Males","15 to 29 years",2018,0.13500000000000001]
[null,"Finland","Males","15 to 29 years",2019,0.13400000000000001]
[null,"Finland","Males","15 to 29 years",2020,0.158]
[null,"Finland","Males","15 to 29 years",2021,0.14000000000000001]
[null,"Finland","Males","15 to 29 years",2022,0.113]
[null,"Finland","Males","15 to 29 years",2023,0.13300000000000001]
[null,"Finland","Males","15 to 29 years",2024,0.156]
[null,"France","Males","15 to 29 years",2010,0.17600000000000002]
[null,"France","Males","15 to 29 years",2011,0.17100000000000001]
[null,"France","Males","15 to 29 years",2012,0.187]
[null,"France","Males","15 to 29 years",2013,0.192]
[null,"France","Males","15 to 29 years",2014,0.19699999999999998]
[null,"France","Males","15 to 29 years",2015,0.19699999999999998]
[null,"France","Males","15 to 29 years",2016,0.188]
[null,"France","Males","15 to 29 years",2017,0.17399999999999999]
[null,"France","Males","15 to 29 years",2018,0.16899999999999998]
[null,"France","Males","15 to 29 years",2019,0.161]
[null,"France","Males","15 to 29 years",2020,0.159]
[null,"France","Males","15 to 29 years",2021,0.14899999999999999]
[null,"France","Males","15 to 29 years",2022,0.14499999999999999]
[null,"France","Males","15 to 29 years",2023,0.14000000000000001]
[null,"France","Males","15 to 29 years",2024,0.14699999999999999]
[null,"Germany","Males","15 to 29 years",2010,9.6999999999999989E-2]
[null,"Germany","Males","15 to 29 years",2011,8.1000000000000003E-2]
[null,"Germany","Males","15 to 29 years",2012,8.4000000000000005E-2]
[null,"Germany","Males","15 to 29 years",2013,8.4000000000000005E-2]
[null,"Germany","Males","15 to 29 years",2014,8.1000000000000003E-2]
[null,"Germany","Males","15 to 29 years",2015,7.6999999999999999E-2]
[null,"Germany","Males","15 to 29 years",2016,7.2999999999999995E-2]
[null,"Germany","Males","15 to 29 years",2017,7.0000000000000007E-2]
[null,"Germany","Males","15 to 29 years",2018,6.5000000000000002E-2]
[null,"Germany","Males","15 to 29 years",2019,5.9000000000000004E-2]
[null,"Germany","Males","15 to 29 years",2020,7.400000000000001E-2]
[null,"Germany","Males","15 to 29 years",2021,6.5000000000000002E-2]
[null,"Germany","Males","15 to 29 years",2022,5.5E-2]
[null,"Germany","Males","15 to 29 years",2023,5.2999999999999999E-2]
[null,"Germany","Males","15 to 29 years",2024,0.06]
[null,"Greece","Males","15 to 29 years",2010,0.20300000000000001]
[null,"Greece","Males","15 to 29 years",2011,0.308]
[null,"Greece","Males","15 to 29 years",2012,0.40500000000000003]
[null,"Greece","Males","15 to 29 years",2013,0.45899999999999996]
[null,"Greece","Males","15 to 29 years",2014,0.41899999999999998]
[null,"Greece","Males","15 to 29 years",2015,0.374]
[null,"Greece","Males","15 to 29 years",2016,0.34299999999999997]
[null,"Greece","Males","15 to 29 years",2017,0.308]
[null,"Greece","Males","15 to 29 years",2018,0.28600000000000003]
[null,"Greece","Males","15 to 29 years",2019,0.26800000000000002]
[null,"Greece","Males","15 to 29 years",2020,0.29299999999999998]
[null,"Greece","Males","15 to 29 years",2021,0.248]
[null,"Greece","Males","15 to 29 years",2022,0.20300000000000001]
[null,"Greece","Males","15 to 29 years",2023,0.193]
[null,"Greece","Males","15 to 29 years",2024,0.188]
[null,"Hungary","Males","15 to 29 years",2010,0.19699999999999998]
[null,"Hungary","Males","15 to 29 years",2011,0.17899999999999999]
[null,"Hungary","Males","15 to 29 years",2012,0.20199999999999999]
[null,"Hungary","Males","15 to 29 years",2013,0.17699999999999999]
[null,"Hungary","Males","15 to 29 years",2014,0.13300000000000001]
[null,"Hungary","Males","15 to 29 years",2015,0.121]
[null,"Hungary","Males","15 to 29 years",2016,8.900000000000001E-2]
[null,"Hungary","Males","15 to 29 years",2017,6.3E-2]
[null,"Hungary","Males","15 to 29 years",2018,6.0999999999999999E-2]
[null,"Hungary","Males","15 to 29 years",2019,7.400000000000001E-2]
[null,"Hungary","Males","15 to 29 years",2020,8.3000000000000004E-2]
[null,"Hungary","Males","15 to 29 years",2021,0.08]
[null,"Hungary","Males","15 to 29 years",2022,7.2000000000000008E-2]
[null,"Hungary","Males","15 to 29 years",2023,8.199999999999999E-2]
[null,"Hungary","Males","15 to 29 years",2024,9.8000000000000004E-2]
[null,"Ireland","Males","15 to 29 years",2010,0.28499999999999998]
[null,"Ireland","Males","15 to 29 years",2011,0.307]
[null,"Ireland","Males","15 to 29 years",2012,0.29699999999999999]
[null,"Ireland","Males","15 to 29 years",2013,0.247]
[null,"Ireland","Males","15 to 29 years",2014,0.223]
[null,"Ireland","Males","15 to 29 years",2015,0.19399999999999998]
[null,"Ireland","Males","15 to 29 years",2016,0.16200000000000001]
[null,"Ireland","Males","15 to 29 years",2017,0.127]
[null,"Ireland","Males","15 to 29 years",2018,0.114]
[null,"Ireland","Males","15 to 29 years",2019,0.109]
[null,"Ireland","Males","15 to 29 years",2020,0.126]
[null,"Ireland","Males","15 to 29 years",2021,0.11800000000000001]
[null,"Ireland","Males","15 to 29 years",2022,8.6999999999999994E-2]
[null,"Ireland","Males","15 to 29 years",2023,9.3000000000000013E-2]
[null,"Ireland","Males","15 to 29 years",2024,8.900000000000001E-2]
[null,"Italy","Males","15 to 29 years",2010,0.19600000000000001]
[null,"Italy","Males","15 to 29 years",2011,0.193]
[null,"Italy","Males","15 to 29 years",2012,0.248]
[null,"Italy","Males","15 to 29 years",2013,0.28999999999999998]
[null,"Italy","Males","15 to 29 years",2014,0.308]
[null,"Italy","Males","15 to 29 years",2015,0.28899999999999998]
[null,"Italy","Males","15 to 29 years",2016,0.26899999999999996]
[null,"Italy","Males","15 to 29 years",2017,0.254]
[null,"Italy","Males","15 to 29 years",2018,0.23499999999999999]
[null,"Italy","Males","15 to 29 years",2019,0.21299999999999999]
[null,"Italy","Males","15 to 29 years",2020,0.214]
[null,"Italy","Males","15 to 29 years",2021,0.214]
[null,"Italy","Males","15 to 29 years",2022,0.16800000000000001]
[null,"Italy","Males","15 to 29 years",2023,0.156]
[null,"Italy","Males","15 to 29 years",2024,0.13900000000000001]
[null,"Latvia","Males","15 to 29 years",2010,0.30199999999999999]
[null,"Latvia","Males","15 to 29 years",2011,0.23800000000000002]
[null,"Latvia","Males","15 to 29 years",2012,0.20399999999999999]
[null,"Latvia","Males","15 to 29 years",2013,0.16600000000000001]
[null,"Latvia","Males","15 to 29 years",2014,0.14000000000000001]
[null,"Latvia","Males","15 to 29 years",2015,0.14000000000000001]
[null,"Latvia","Males","15 to 29 years",2016,0.14800000000000002]
[null,"Latvia","Males","15 to 29 years",2017,0.11699999999999999]
[null,"Latvia","Males","15 to 29 years",2018,0.113]
[null,"Latvia","Males","15 to 29 years",2019,0.10199999999999999]
[null,"Latvia","Males","15 to 29 years",2020,0.13500000000000001]
[null,"Latvia","Males","15 to 29 years",2021,0.127]
[null,"Latvia","Males","15 to 29 years",2022,0.13500000000000001]
[null,"Latvia","Males","15 to 29 years",2023,0.111]
[null,"Latvia","Males","15 to 29 years",2024,0.107]
[null,"Lithuania","Males","15 to 29 years",2010,0.317]
[null,"Lithuania","Males","15 to 29 years",2011,0.26200000000000001]
[null,"Lithuania","Males","15 to 29 years",2012,0.21899999999999997]
[null,"Lithuania","Males","15 to 29 years",2013,0.17800000000000002]
[null,"Lithuania","Males","15 to 29 years",2014,0.156]
[null,"Lithuania","Males","15 to 29 years",2015,0.12300000000000001]
[null,"Lithuania","Males","15 to 29 years",2016,0.115]
[null,"Lithuania","Males","15 to 29 years",2017,9.6999999999999989E-2]
[null,"Lithuania","Males","15 to 29 years",2018,8.5999999999999993E-2]
[null,"Lithuania","Males","15 to 29 years",2019,0.10300000000000001]
[null,"Lithuania","Males","15 to 29 years",2020,0.151]
[null,"Lithuania","Males","15 to 29 years",2021,9.6999999999999989E-2]
[null,"Lithuania","Males","15 to 29 years",2022,8.5000000000000006E-2]
[null,"Lithuania","Males","15 to 29 years",2023,0.111]
[null,"Lithuania","Males","15 to 29 years",2024,0.111]
[null,"Luxembourg","Males","15 to 29 years",2010,8.6999999999999994E-2]
[null,"Luxembourg","Males","15 to 29 years",2011,8.5000000000000006E-2]
[null,"Luxembourg","Males","15 to 29 years",2012,0.1]
[null,"Luxembourg","Males","15 to 29 years",2013,0.12300000000000001]
[null,"Luxembourg","Males","15 to 29 years",2014,0.14699999999999999]
[null,"Luxembourg","Males","15 to 29 years",2015,0.114]
[null,"Luxembourg","Males","15 to 29 years",2016,0.10400000000000001]
[null,"Luxembourg","Males","15 to 29 years",2017,0.109]
[null,"Luxembourg","Males","15 to 29 years",2018,0.10099999999999999]
[null,"Luxembourg","Males","15 to 29 years",2019,0.11900000000000001]
[null,"Luxembourg","Males","15 to 29 years",2020,0.14899999999999999]
[null,"Luxembourg","Males","15 to 29 years",2021,9.5000000000000001E-2]
[null,"Luxembourg","Males","15 to 29 years",2022,8.3000000000000004E-2]
[null,"Luxembourg","Males","15 to 29 years",2023,9.6999999999999989E-2]
[null,"Luxembourg","Males","15 to 29 years",2024,0.14699999999999999]
[null,"Malta","Males","15 to 29 years",2010,0.115]
[null,"Malta","Males","15 to 29 years",2011,0.105]
[null,"Malta","Males","15 to 29 years",2012,9.4E-2]
[null,"Malta","Males","15 to 29 years",2013,0.10800000000000001]
[null,"Malta","Males","15 to 29 years",2014,0.105]
[null,"Malta","Males","15 to 29 years",2015,0.09]
[null,"Malta","Males","15 to 29 years",2016,7.6999999999999999E-2]
[null,"Malta","Males","15 to 29 years",2017,0.08]
[null,"Malta","Males","15 to 29 years",2018,6.9000000000000006E-2]
[null,"Malta","Males","15 to 29 years",2019,7.4999999999999997E-2]
[null,"Malta","Males","15 to 29 years",2020,8.5000000000000006E-2]
[null,"Malta","Males","15 to 29 years",2021,8.5000000000000006E-2]
[null,"Malta","Males","15 to 29 years",2022,7.8E-2]
[null,"Malta","Males","15 to 29 years",2023,7.400000000000001E-2]
[null,"Malta","Males","15 to 29 years",2024,6.6000000000000003E-2]
[null,"Netherlands","Males","15 to 29 years",2010,0.106]
[null,"Netherlands","Males","15 to 29 years",2011,9.8000000000000004E-2]
[null,"Netherlands","Males","15 to 29 years",2012,0.10800000000000001]
[null,"Netherlands","Males","15 to 29 years",2013,0.126]
[null,"Netherlands","Males","15 to 29 years",2014,0.11599999999999999]
[null,"Netherlands","Males","15 to 29 years",2015,0.107]
[null,"Netherlands","Males","15 to 29 years",2016,0.10300000000000001]
[null,"Netherlands","Males","15 to 29 years",2017,8.4000000000000005E-2]
[null,"Netherlands","Males","15 to 29 years",2018,7.5999999999999998E-2]
[null,"Netherlands","Males","15 to 29 years",2019,7.5999999999999998E-2]
[null,"Netherlands","Males","15 to 29 years",2020,0.09]
[null,"Netherlands","Males","15 to 29 years",2021,7.400000000000001E-2]
[null,"Netherlands","Males","15 to 29 years",2022,6.3E-2]
[null,"Netherlands","Males","15 to 29 years",2023,6.8000000000000005E-2]
[null,"Netherlands","Males","15 to 29 years",2024,7.0000000000000007E-2]
[null,"Poland","Males","15 to 29 years",2010,0.16699999999999998]
[null,"Poland","Males","15 to 29 years",2011,0.16500000000000001]
[null,"Poland","Males","15 to 29 years",2012,0.16899999999999998]
[null,"Poland","Males","15 to 29 years",2013,0.17800000000000002]
[null,"Poland","Males","15 to 29 years",2014,0.161]
[null,"Poland","Males","15 to 29 years",2015,0.14800000000000002]
[null,"Poland","Males","15 to 29 years",2016,0.11900000000000001]
[null,"Poland","Males","15 to 29 years",2017,9.4E-2]
[null,"Poland","Males","15 to 29 years",2018,7.400000000000001E-2]
[null,"Poland","Males","15 to 29 years",2019,6.0999999999999999E-2]
[null,"Poland","Males","15 to 29 years",2020,6.9000000000000006E-2]
[null,"Poland","Males","15 to 29 years",2021,7.2999999999999995E-2]
[null,"Poland","Males","15 to 29 years",2022,6.6000000000000003E-2]
[null,"Poland","Males","15 to 29 years",2023,6.2E-2]
[null,"Poland","Males","15 to 29 years",2024,6.3E-2]
[null,"Portugal","Males","15 to 29 years",2010,0.20100000000000001]
[null,"Portugal","Males","15 to 29 years",2011,0.21899999999999997]
[null,"Portugal","Males","15 to 29 years",2012,0.27800000000000002]
[null,"Portugal","Males","15 to 29 years",2013,0.28800000000000003]
[null,"Portugal","Males","15 to 29 years",2014,0.251]
[null,"Portugal","Males","15 to 29 years",2015,0.223]
[null,"Portugal","Males","15 to 29 years",2016,0.20899999999999999]
[null,"Portugal","Males","15 to 29 years",2017,0.16399999999999998]
[null,"Portugal","Males","15 to 29 years",2018,0.14199999999999999]
[null,"Portugal","Males","15 to 29 years",2019,0.11699999999999999]
[null,"Portugal","Males","15 to 29 years",2020,0.159]
[null,"Portugal","Males","15 to 29 years",2021,0.14099999999999999]
[null,"Portugal","Males","15 to 29 years",2022,0.13300000000000001]
[null,"Portugal","Males","15 to 29 years",2023,0.14199999999999999]
[null,"Portugal","Males","15 to 29 years",2024,0.14099999999999999]
[null,"Romania","Males","15 to 29 years",2010,0.187]
[null,"Romania","Males","15 to 29 years",2011,0.192]
[null,"Romania","Males","15 to 29 years",2012,0.193]
[null,"Romania","Males","15 to 29 years",2013,0.19399999999999998]
[null,"Romania","Males","15 to 29 years",2014,0.19]
[null,"Romania","Males","15 to 29 years",2015,0.17499999999999999]
[null,"Romania","Males","15 to 29 years",2016,0.158]
[null,"Romania","Males","15 to 29 years",2017,0.15]
[null,"Romania","Males","15 to 29 years",2018,0.129]
[null,"Romania","Males","15 to 29 years",2019,0.129]
[null,"Romania","Males","15 to 29 years",2020,0.13900000000000001]
[null,"Romania","Males","15 to 29 years",2021,0.13600000000000001]
[null,"Romania","Males","15 to 29 years",2022,0.14400000000000002]
[null,"Romania","Males","15 to 29 years",2023,0.13300000000000001]
[null,"Romania","Males","15 to 29 years",2024,0.14499999999999999]
[null,"Slovakia","Males","15 to 29 years",2010,0.245]
[null,"Slovakia","Males","15 to 29 years",2011,0.23300000000000001]
[null,"Slovakia","Males","15 to 29 years",2012,0.23100000000000001]
[null,"Slovakia","Males","15 to 29 years",2013,0.248]
[null,"Slovakia","Males","15 to 29 years",2014,0.215]
[null,"Slovakia","Males","15 to 29 years",2015,0.16600000000000001]
[null,"Slovakia","Males","15 to 29 years",2016,0.13600000000000001]
[null,"Slovakia","Males","15 to 29 years",2017,0.122]
[null,"Slovakia","Males","15 to 29 years",2018,0.106]
[null,"Slovakia","Males","15 to 29 years",2019,9.4E-2]
[null,"Slovakia","Males","15 to 29 years",2020,0.11199999999999999]
[null,"Slovakia","Males","15 to 29 years",2021,0.11900000000000001]
[null,"Slovakia","Males","15 to 29 years",2022,0.113]
[null,"Slovakia","Males","15 to 29 years",2023,0.126]
[null,"Slovakia","Males","15 to 29 years",2024,0.115]
[null,"Slovenia","Males","15 to 29 years",2010,0.13900000000000001]
[null,"Slovenia","Males","15 to 29 years",2011,0.14000000000000001]
[null,"Slovenia","Males","15 to 29 years",2012,0.157]
[null,"Slovenia","Males","15 to 29 years",2013,0.17199999999999999]
[null,"Slovenia","Males","15 to 29 years",2014,0.16200000000000001]
[null,"Slovenia","Males","15 to 29 years",2015,0.14800000000000002]
[null,"Slovenia","Males","15 to 29 years",2016,0.13500000000000001]
[null,"Slovenia","Males","15 to 29 years",2017,8.4000000000000005E-2]
[null,"Slovenia","Males","15 to 29 years",2018,8.1000000000000003E-2]
[null,"Slovenia","Males","15 to 29 years",2019,6.3E-2]
[null,"Slovenia","Males","15 to 29 years",2020,8.6999999999999994E-2]
[null,"Slovenia","Males","15 to 29 years",2021,8.3000000000000004E-2]
[null,"Slovenia","Males","15 to 29 years",2022,6.9000000000000006E-2]
[null,"Slovenia","Males","15 to 29 years",2023,7.8E-2]
[null,"Slovenia","Males","15 to 29 years",2024,7.0000000000000007E-2]
[null,"Spain","Males","15 to 29 years",2010,0.33299999999999996]
[null,"Spain","Males","15 to 29 years",2011,0.36]
[null,"Spain","Males","15 to 29 years",2012,0.42100000000000004]
[null,"Spain","Males","15 to 29 years",2013,0.43700000000000006]
[null,"Spain","Males","15 to 29 years",2014,0.40200000000000002]
[null,"Spain","Males","15 to 29 years",2015,0.373]
[null,"Spain","Males","15 to 29 years",2016,0.32899999999999996]
[null,"Spain","Males","15 to 29 years",2017,0.29499999999999998]
[null,"Spain","Males","15 to 29 years",2018,0.26200000000000001]
[null,"Spain","Males","15 to 29 years",2019,0.24100000000000002]
[null,"Spain","Males","15 to 29 years",2020,0.28499999999999998]
[null,"Spain","Males","15 to 29 years",2021,0.26899999999999996]
[null,"Spain","Males","15 to 29 years",2022,0.21600000000000003]
[null,"Spain","Males","15 to 29 years",2023,0.21299999999999999]
[null,"Spain","Males","15 to 29 years",2024,0.2]
[null,"Sweden","Males","15 to 29 years",2010,0.18899999999999997]
[null,"Sweden","Males","15 to 29 years",2011,0.17]
[null,"Sweden","Males","15 to 29 years",2012,0.183]
[null,"Sweden","Males","15 to 29 years",2013,0.17899999999999999]
[null,"Sweden","Males","15 to 29 years",2014,0.17699999999999999]
[null,"Sweden","Males","15 to 29 years",2015,0.154]
[null,"Sweden","Males","15 to 29 years",2016,0.14599999999999999]
[null,"Sweden","Males","15 to 29 years",2017,0.13500000000000001]
[null,"Sweden","Males","15 to 29 years",2018,0.129]
[null,"Sweden","Males","15 to 29 years",2019,0.13699999999999998]
[null,"Sweden","Males","15 to 29 years",2020,0.17600000000000002]
[null,"Sweden","Males","15 to 29 years",2021,0.17699999999999999]
[null,"Sweden","Males","15 to 29 years",2022,0.14199999999999999]
[null,"Sweden","Males","15 to 29 years",2023,0.158]
[null,"Sweden","Males","15 to 29 years",2024,0.17499999999999999]
[null,"Austria","Males","15 to 74 years",2010,5.5E-2]
[null,"Austria","Males","15 to 74 years",2011,0.05]
[null,"Austria","Males","15 to 74 years",2012,5.4000000000000006E-2]
[null,"Austria","Males","15 to 74 years",2013,5.9000000000000004E-2]
[null,"Austria","Males","15 to 74 years",2014,6.4000000000000001E-2]
[null,"Austria","Males","15 to 74 years",2015,6.7000000000000004E-2]
[null,"Austria","Males","15 to 74 years",2016,7.0000000000000007E-2]
[null,"Austria","Males","15 to 74 years",2017,6.5000000000000002E-2]
[null,"Austria","Males","15 to 74 years",2018,5.5E-2]
[null,"Austria","Males","15 to 74 years",2019,5.0999999999999997E-2]
[null,"Austria","Males","15 to 74 years",2020,6.0999999999999999E-2]
[null,"Austria","Males","15 to 74 years",2021,6.3E-2]
[null,"Austria","Males","15 to 74 years",2022,4.9000000000000002E-2]
[null,"Austria","Males","15 to 74 years",2023,5.2999999999999999E-2]
[null,"Austria","Males","15 to 74 years",2024,5.5999999999999994E-2]
[null,"Belgium","Males","15 to 74 years",2010,8.199999999999999E-2]
[null,"Belgium","Males","15 to 74 years",2011,7.2000000000000008E-2]
[null,"Belgium","Males","15 to 74 years",2012,7.8E-2]
[null,"Belgium","Males","15 to 74 years",2013,8.8000000000000009E-2]
[null,"Belgium","Males","15 to 74 years",2014,9.0999999999999998E-2]
[null,"Belgium","Males","15 to 74 years",2015,9.3000000000000013E-2]
[null,"Belgium","Males","15 to 74 years",2016,8.199999999999999E-2]
[null,"Belgium","Males","15 to 74 years",2017,7.2000000000000008E-2]
[null,"Belgium","Males","15 to 74 years",2018,6.4000000000000001E-2]
[null,"Belgium","Males","15 to 74 years",2019,5.9000000000000004E-2]
[null,"Belgium","Males","15 to 74 years",2020,0.06]
[null,"Belgium","Males","15 to 74 years",2021,6.6000000000000003E-2]
[null,"Belgium","Males","15 to 74 years",2022,5.7999999999999996E-2]
[null,"Belgium","Males","15 to 74 years",2023,0.06]
[null,"Belgium","Males","15 to 74 years",2024,6.0999999999999999E-2]
[null,"Bulgaria","Males","15 to 74 years",2010,0.12]
[null,"Bulgaria","Males","15 to 74 years",2011,0.13300000000000001]
[null,"Bulgaria","Males","15 to 74 years",2012,0.14599999999999999]
[null,"Bulgaria","Males","15 to 74 years",2013,0.14899999999999999]
[null,"Bulgaria","Males","15 to 74 years",2014,0.13300000000000001]
[null,"Bulgaria","Males","15 to 74 years",2015,0.10800000000000001]
[null,"Bulgaria","Males","15 to 74 years",2016,9.1999999999999998E-2]
[null,"Bulgaria","Males","15 to 74 years",2017,7.400000000000001E-2]
[null,"Bulgaria","Males","15 to 74 years",2018,6.7000000000000004E-2]
[null,"Bulgaria","Males","15 to 74 years",2019,5.5E-2]
[null,"Bulgaria","Males","15 to 74 years",2020,6.4000000000000001E-2]
[null,"Bulgaria","Males","15 to 74 years",2021,5.4000000000000006E-2]
[null,"Bulgaria","Males","15 to 74 years",2022,4.2999999999999997E-2]
[null,"Bulgaria","Males","15 to 74 years",2023,4.4000000000000004E-2]
[null,"Bulgaria","Males","15 to 74 years",2024,4.4000000000000004E-2]
[null,"Croatia","Males","15 to 74 years",2010,0.111]
[null,"Croatia","Males","15 to 74 years",2011,0.13699999999999998]
[null,"Croatia","Males","15 to 74 years",2012,0.16200000000000001]
[null,"Croatia","Males","15 to 74 years",2013,0.17699999999999999]
[null,"Croatia","Males","15 to 74 years",2014,0.16300000000000001]
[null,"Croatia","Males","15 to 74 years",2015,0.155]
[null,"Croatia","Males","15 to 74 years",2016,0.124]
[null,"Croatia","Males","15 to 74 years",2017,0.105]
[null,"Croatia","Males","15 to 74 years",2018,7.4999999999999997E-2]
[null,"Croatia","Males","15 to 74 years",2019,6.0999999999999999E-2]
[null,"Croatia","Males","15 to 74 years",2020,7.2999999999999995E-2]
[null,"Croatia","Males","15 to 74 years",2021,7.0999999999999994E-2]
[null,"Croatia","Males","15 to 74 years",2022,5.9000000000000004E-2]
[null,"Croatia","Males","15 to 74 years",2023,5.7000000000000002E-2]
[null,"Croatia","Males","15 to 74 years",2024,0.05]
[null,"Cyprus","Males","15 to 74 years",2010,6.2E-2]
[null,"Cyprus","Males","15 to 74 years",2011,8.1000000000000003E-2]
[null,"Cyprus","Males","15 to 74 years",2012,0.126]
[null,"Cyprus","Males","15 to 74 years",2013,0.16600000000000001]
[null,"Cyprus","Males","15 to 74 years",2014,0.17100000000000001]
[null,"Cyprus","Males","15 to 74 years",2015,0.151]
[null,"Cyprus","Males","15 to 74 years",2016,0.127]
[null,"Cyprus","Males","15 to 74 years",2017,0.109]
[null,"Cyprus","Males","15 to 74 years",2018,8.1000000000000003E-2]
[null,"Cyprus","Males","15 to 74 years",2019,6.7000000000000004E-2]
[null,"Cyprus","Males","15 to 74 years",2020,7.6999999999999999E-2]
[null,"Cyprus","Males","15 to 74 years",2021,7.0000000000000007E-2]
[null,"Cyprus","Males","15 to 74 years",2022,5.7999999999999996E-2]
[null,"Cyprus","Males","15 to 74 years",2023,5.7999999999999996E-2]
[null,"Cyprus","Males","15 to 74 years",2024,4.5999999999999999E-2]
[null,"Czechia","Males","15 to 74 years",2010,6.4000000000000001E-2]
[null,"Czechia","Males","15 to 74 years",2011,5.7999999999999996E-2]
[null,"Czechia","Males","15 to 74 years",2012,0.06]
[null,"Czechia","Males","15 to 74 years",2013,5.9000000000000004E-2]
[null,"Czechia","Males","15 to 74 years",2014,5.0999999999999997E-2]
[null,"Czechia","Males","15 to 74 years",2015,4.2000000000000003E-2]
[null,"Czechia","Males","15 to 74 years",2016,3.4000000000000002E-2]
[null,"Czechia","Males","15 to 74 years",2017,2.3E-2]
[null,"Czechia","Males","15 to 74 years",2018,1.8000000000000002E-2]
[null,"Czechia","Males","15 to 74 years",2019,1.7000000000000001E-2]
[null,"Czechia","Males","15 to 74 years",2020,2.2000000000000002E-2]
[null,"Czechia","Males","15 to 74 years",2021,2.3E-2]
[null,"Czechia","Males","15 to 74 years",2022,1.8000000000000002E-2]
[null,"Czechia","Males","15 to 74 years",2023,2.2000000000000002E-2]
[null,"Czechia","Males","15 to 74 years",2024,2.3E-2]
[null,"Denmark","Males","15 to 74 years",2010,8.5999999999999993E-2]
[null,"Denmark","Males","15 to 74 years",2011,7.9000000000000001E-2]
[null,"Denmark","Males","15 to 74 years",2012,7.8E-2]
[null,"Denmark","Males","15 to 74 years",2013,7.0999999999999994E-2]
[null,"Denmark","Males","15 to 74 years",2014,6.7000000000000004E-2]
[null,"Denmark","Males","15 to 74 years",2015,6.0999999999999999E-2]
[null,"Denmark","Males","15 to 74 years",2016,5.5999999999999994E-2]
[null,"Denmark","Males","15 to 74 years",2017,5.5999999999999994E-2]
[null,"Denmark","Males","15 to 74 years",2018,4.9000000000000002E-2]
[null,"Denmark","Males","15 to 74 years",2019,4.8000000000000001E-2]
[null,"Denmark","Males","15 to 74 years",2020,5.2999999999999999E-2]
[null,"Denmark","Males","15 to 74 years",2021,0.05]
[null,"Denmark","Males","15 to 74 years",2022,4.4000000000000004E-2]
[null,"Denmark","Males","15 to 74 years",2023,0.05]
[null,"Denmark","Males","15 to 74 years",2024,5.9000000000000004E-2]
[null,"Estonia","Males","15 to 74 years",2010,0.192]
[null,"Estonia","Males","15 to 74 years",2011,0.13100000000000001]
[null,"Estonia","Males","15 to 74 years",2012,0.109]
[null,"Estonia","Males","15 to 74 years",2013,9.0999999999999998E-2]
[null,"Estonia","Males","15 to 74 years",2014,7.9000000000000001E-2]
[null,"Estonia","Males","15 to 74 years",2015,6.5000000000000002E-2]
[null,"Estonia","Males","15 to 74 years",2016,7.5999999999999998E-2]
[null,"Estonia","Males","15 to 74 years",2017,6.3E-2]
[null,"Estonia","Males","15 to 74 years",2018,5.5999999999999994E-2]
[null,"Estonia","Males","15 to 74 years",2019,4.0999999999999995E-2]
[null,"Estonia","Males","15 to 74 years",2020,7.0999999999999994E-2]
[null,"Estonia","Males","15 to 74 years",2021,6.8000000000000005E-2]
[null,"Estonia","Males","15 to 74 years",2022,6.0999999999999999E-2]
[null,"Estonia","Males","15 to 74 years",2023,6.2E-2]
[null,"Estonia","Males","15 to 74 years",2024,7.5999999999999998E-2]
[null,"Finland","Males","15 to 74 years",2010,9.4E-2]
[null,"Finland","Males","15 to 74 years",2011,8.6999999999999994E-2]
[null,"Finland","Males","15 to 74 years",2012,8.5999999999999993E-2]
[null,"Finland","Males","15 to 74 years",2013,9.0999999999999998E-2]
[null,"Finland","Males","15 to 74 years",2014,9.6000000000000002E-2]
[null,"Finland","Males","15 to 74 years",2015,0.10199999999999999]
[null,"Finland","Males","15 to 74 years",2016,9.4E-2]
[null,"Finland","Males","15 to 74 years",2017,9.0999999999999998E-2]
[null,"Finland","Males","15 to 74 years",2018,7.6999999999999999E-2]
[null,"Finland","Males","15 to 74 years",2019,7.2999999999999995E-2]
[null,"Finland","Males","15 to 74 years",2020,8.1000000000000003E-2]
[null,"Finland","Males","15 to 74 years",2021,8.199999999999999E-2]
[null,"Finland","Males","15 to 74 years",2022,7.0999999999999994E-2]
[null,"Finland","Males","15 to 74 years",2023,7.9000000000000001E-2]
[null,"Finland","Males","15 to 74 years",2024,9.1999999999999998E-2]
[null,"France","Males","15 to 74 years",2010,9.0999999999999998E-2]
[null,"France","Males","15 to 74 years",2011,8.900000000000001E-2]
[null,"France","Males","15 to 74 years",2012,9.8000000000000004E-2]
[null,"France","Males","15 to 74 years",2013,0.10400000000000001]
[null,"France","Males","15 to 74 years",2014,0.106]
[null,"France","Males","15 to 74 years",2015,0.10800000000000001]
[null,"France","Males","15 to 74 years",2016,0.10300000000000001]
[null,"France","Males","15 to 74 years",2017,9.5000000000000001E-2]
[null,"France","Males","15 to 74 years",2018,0.09]
[null,"France","Males","15 to 74 years",2019,8.5000000000000006E-2]
[null,"France","Males","15 to 74 years",2020,8.1000000000000003E-2]
[null,"France","Males","15 to 74 years",2021,0.08]
[null,"France","Males","15 to 74 years",2022,7.4999999999999997E-2]
[null,"France","Males","15 to 74 years",2023,7.4999999999999997E-2]
[null,"France","Males","15 to 74 years",2024,7.4999999999999997E-2]
[null,"Germany","Males","15 to 74 years",2010,7.0000000000000007E-2]
[null,"Germany","Males","15 to 74 years",2011,5.7000000000000002E-2]
[null,"Germany","Males","15 to 74 years",2012,5.2999999999999999E-2]
[null,"Germany","Males","15 to 74 years",2013,5.2000000000000005E-2]
[null,"Germany","Males","15 to 74 years",2014,0.05]
[null,"Germany","Males","15 to 74 years",2015,4.7E-2]
[null,"Germany","Males","15 to 74 years",2016,4.2000000000000003E-2]
[null,"Germany","Males","15 to 74 years",2017,3.9E-2]
[null,"Germany","Males","15 to 74 years",2018,3.6000000000000004E-2]
[null,"Germany","Males","15 to 74 years",2019,3.3000000000000002E-2]
[null,"Germany","Males","15 to 74 years",2020,0.04]
[null,"Germany","Males","15 to 74 years",2021,3.9E-2]
[null,"Germany","Males","15 to 74 years",2022,3.4000000000000002E-2]
[null,"Germany","Males","15 to 74 years",2023,3.3000000000000002E-2]
[null,"Germany","Males","15 to 74 years",2024,3.6000000000000004E-2]
[null,"Greece","Males","15 to 74 years",2010,0.10199999999999999]
[null,"Greece","Males","15 to 74 years",2011,0.153]
[null,"Greece","Males","15 to 74 years",2012,0.21899999999999997]
[null,"Greece","Males","15 to 74 years",2013,0.248]
[null,"Greece","Males","15 to 74 years",2014,0.23699999999999999]
[null,"Greece","Males","15 to 74 years",2015,0.218]
[null,"Greece","Males","15 to 74 years",2016,0.20199999999999999]
[null,"Greece","Males","15 to 74 years",2017,0.182]
[null,"Greece","Males","15 to 74 years",2018,0.158]
[null,"Greece","Males","15 to 74 years",2019,0.14400000000000002]
[null,"Greece","Males","15 to 74 years",2020,0.14599999999999999]
[null,"Greece","Males","15 to 74 years",2021,0.114]
[null,"Greece","Males","15 to 74 years",2022,9.3000000000000013E-2]
[null,"Greece","Males","15 to 74 years",2023,8.5000000000000006E-2]
[null,"Greece","Males","15 to 74 years",2024,0.08]
[null,"Hungary","Males","15 to 74 years",2010,0.11599999999999999]
[null,"Hungary","Males","15 to 74 years",2011,0.111]
[null,"Hungary","Males","15 to 74 years",2012,0.113]
[null,"Hungary","Males","15 to 74 years",2013,0.10199999999999999]
[null,"Hungary","Males","15 to 74 years",2014,7.5999999999999998E-2]
[null,"Hungary","Males","15 to 74 years",2015,6.6000000000000003E-2]
[null,"Hungary","Males","15 to 74 years",2016,5.0999999999999997E-2]
[null,"Hungary","Males","15 to 74 years",2017,3.7999999999999999E-2]
[null,"Hungary","Males","15 to 74 years",2018,3.4000000000000002E-2]
[null,"Hungary","Males","15 to 74 years",2019,3.3000000000000002E-2]
[null,"Hungary","Males","15 to 74 years",2020,4.0999999999999995E-2]
[null,"Hungary","Males","15 to 74 years",2021,3.9E-2]
[null,"Hungary","Males","15 to 74 years",2022,3.7000000000000005E-2]
[null,"Hungary","Males","15 to 74 years",2023,4.0999999999999995E-2]
[null,"Hungary","Males","15 to 74 years",2024,4.5999999999999999E-2]
[null,"Ireland","Males","15 to 74 years",2010,0.17100000000000001]
[null,"Ireland","Males","15 to 74 years",2011,0.17800000000000002]
[null,"Ireland","Males","15 to 74 years",2012,0.17800000000000002]
[null,"Ireland","Males","15 to 74 years",2013,0.14899999999999999]
[null,"Ireland","Males","15 to 74 years",2014,0.127]
[null,"Ireland","Males","15 to 74 years",2015,0.10800000000000001]
[null,"Ireland","Males","15 to 74 years",2016,9.0999999999999998E-2]
[null,"Ireland","Males","15 to 74 years",2017,7.0999999999999994E-2]
[null,"Ireland","Males","15 to 74 years",2018,5.7999999999999996E-2]
[null,"Ireland","Males","15 to 74 years",2019,5.2000000000000005E-2]
[null,"Ireland","Males","15 to 74 years",2020,5.7999999999999996E-2]
[null,"Ireland","Males","15 to 74 years",2021,6.3E-2]
[null,"Ireland","Males","15 to 74 years",2022,4.4000000000000004E-2]
[null,"Ireland","Males","15 to 74 years",2023,4.4000000000000004E-2]
[null,"Ireland","Males","15 to 74 years",2024,4.2999999999999997E-2]
[null,"Italy","Males","15 to 74 years",2010,7.6999999999999999E-2]
[null,"Italy","Males","15 to 74 years",2011,7.6999999999999999E-2]
[null,"Italy","Males","15 to 74 years",2012,0.10099999999999999]
[null,"Italy","Males","15 to 74 years",2013,0.11699999999999999]
[null,"Italy","Males","15 to 74 years",2014,0.121]
[null,"Italy","Males","15 to 74 years",2015,0.115]
[null,"Italy","Males","15 to 74 years",2016,0.11]
[null,"Italy","Males","15 to 74 years",2017,0.10400000000000001]
[null,"Italy","Males","15 to 74 years",2018,9.6999999999999989E-2]
[null,"Italy","Males","15 to 74 years",2019,9.0999999999999998E-2]
[null,"Italy","Males","15 to 74 years",2020,8.5999999999999993E-2]
[null,"Italy","Males","15 to 74 years",2021,8.6999999999999994E-2]
[null,"Italy","Males","15 to 74 years",2022,7.0999999999999994E-2]
[null,"Italy","Males","15 to 74 years",2023,6.8000000000000005E-2]
[null,"Italy","Males","15 to 74 years",2024,5.9000000000000004E-2]
[null,"Latvia","Males","15 to 74 years",2010,0.23]
[null,"Latvia","Males","15 to 74 years",2011,0.188]
[null,"Latvia","Males","15 to 74 years",2012,0.16200000000000001]
[null,"Latvia","Males","15 to 74 years",2013,0.127]
[null,"Latvia","Males","15 to 74 years",2014,0.11900000000000001]
[null,"Latvia","Males","15 to 74 years",2015,0.111]
[null,"Latvia","Males","15 to 74 years",2016,0.11]
[null,"Latvia","Males","15 to 74 years",2017,9.8000000000000004E-2]
[null,"Latvia","Males","15 to 74 years",2018,8.4000000000000005E-2]
[null,"Latvia","Males","15 to 74 years",2019,7.2000000000000008E-2]
[null,"Latvia","Males","15 to 74 years",2020,9.0999999999999998E-2]
[null,"Latvia","Males","15 to 74 years",2021,8.5000000000000006E-2]
[null,"Latvia","Males","15 to 74 years",2022,8.1000000000000003E-2]
[null,"Latvia","Males","15 to 74 years",2023,7.5999999999999998E-2]
[null,"Latvia","Males","15 to 74 years",2024,0.08]
[null,"Lithuania","Males","15 to 74 years",2010,0.21199999999999999]
[null,"Lithuania","Males","15 to 74 years",2011,0.17899999999999999]
[null,"Lithuania","Males","15 to 74 years",2012,0.152]
[null,"Lithuania","Males","15 to 74 years",2013,0.13100000000000001]
[null,"Lithuania","Males","15 to 74 years",2014,0.122]
[null,"Lithuania","Males","15 to 74 years",2015,0.10099999999999999]
[null,"Lithuania","Males","15 to 74 years",2016,9.0999999999999998E-2]
[null,"Lithuania","Males","15 to 74 years",2017,8.5999999999999993E-2]
[null,"Lithuania","Males","15 to 74 years",2018,6.9000000000000006E-2]
[null,"Lithuania","Males","15 to 74 years",2019,7.0999999999999994E-2]
[null,"Lithuania","Males","15 to 74 years",2020,9.3000000000000013E-2]
[null,"Lithuania","Males","15 to 74 years",2021,7.5999999999999998E-2]
[null,"Lithuania","Males","15 to 74 years",2022,6.5000000000000002E-2]
[null,"Lithuania","Males","15 to 74 years",2023,7.2999999999999995E-2]
[null,"Lithuania","Males","15 to 74 years",2024,7.8E-2]
[null,"Luxembourg","Males","15 to 74 years",2010,3.7999999999999999E-2]
[null,"Luxembourg","Males","15 to 74 years",2011,3.7999999999999999E-2]
[null,"Luxembourg","Males","15 to 74 years",2012,4.4999999999999998E-2]
[null,"Luxembourg","Males","15 to 74 years",2013,5.4000000000000006E-2]
[null,"Luxembourg","Males","15 to 74 years",2014,5.9000000000000004E-2]
[null,"Luxembourg","Males","15 to 74 years",2015,6.0999999999999999E-2]
[null,"Luxembourg","Males","15 to 74 years",2016,0.06]
[null,"Luxembourg","Males","15 to 74 years",2017,5.5999999999999994E-2]
[null,"Luxembourg","Males","15 to 74 years",2018,5.2999999999999999E-2]
[null,"Luxembourg","Males","15 to 74 years",2019,5.7000000000000002E-2]
[null,"Luxembourg","Males","15 to 74 years",2020,6.6000000000000003E-2]
[null,"Luxembourg","Males","15 to 74 years",2021,4.9000000000000002E-2]
[null,"Luxembourg","Males","15 to 74 years",2022,4.4999999999999998E-2]
[null,"Luxembourg","Males","15 to 74 years",2023,0.05]
[null,"Luxembourg","Males","15 to 74 years",2024,6.6000000000000003E-2]
[null,"Malta","Males","15 to 74 years",2010,6.7000000000000004E-2]
[null,"Malta","Males","15 to 74 years",2011,0.06]
[null,"Malta","Males","15 to 74 years",2012,5.5999999999999994E-2]
[null,"Malta","Males","15 to 74 years",2013,6.0999999999999999E-2]
[null,"Malta","Males","15 to 74 years",2014,6.0999999999999999E-2]
[null,"Malta","Males","15 to 74 years",2015,5.4000000000000006E-2]
[null,"Malta","Males","15 to 74 years",2016,4.4000000000000004E-2]
[null,"Malta","Males","15 to 74 years",2017,3.7999999999999999E-2]
[null,"Malta","Males","15 to 74 years",2018,4.0999999999999995E-2]
[null,"Malta","Males","15 to 74 years",2019,3.7000000000000005E-2]
[null,"Malta","Males","15 to 74 years",2020,4.7E-2]
[null,"Malta","Males","15 to 74 years",2021,3.9E-2]
[null,"Malta","Males","15 to 74 years",2022,3.7000000000000005E-2]
[null,"Malta","Males","15 to 74 years",2023,3.7000000000000005E-2]
[null,"Malta","Males","15 to 74 years",2024,3.2000000000000001E-2]
[null,"Netherlands","Males","15 to 74 years",2010,5.5E-2]
[null,"Netherlands","Males","15 to 74 years",2011,5.5999999999999994E-2]
[null,"Netherlands","Males","15 to 74 years",2012,6.4000000000000001E-2]
[null,"Netherlands","Males","15 to 74 years",2013,8.1000000000000003E-2]
[null,"Netherlands","Males","15 to 74 years",2014,0.08]
[null,"Netherlands","Males","15 to 74 years",2015,7.400000000000001E-2]
[null,"Netherlands","Males","15 to 74 years",2016,6.5000000000000002E-2]
[null,"Netherlands","Males","15 to 74 years",2017,5.4000000000000006E-2]
[null,"Netherlands","Males","15 to 74 years",2018,4.7E-2]
[null,"Netherlands","Males","15 to 74 years",2019,4.2999999999999997E-2]
[null,"Netherlands","Males","15 to 74 years",2020,4.5999999999999999E-2]
[null,"Netherlands","Males","15 to 74 years",2021,0.04]
[null,"Netherlands","Males","15 to 74 years",2022,3.3000000000000002E-2]
[null,"Netherlands","Males","15 to 74 years",2023,3.4000000000000002E-2]
[null,"Netherlands","Males","15 to 74 years",2024,3.5000000000000003E-2]
[null,"Poland","Males","15 to 74 years",2010,9.6999999999999989E-2]
[null,"Poland","Males","15 to 74 years",2011,9.4E-2]
[null,"Poland","Males","15 to 74 years",2012,9.6999999999999989E-2]
[null,"Poland","Males","15 to 74 years",2013,0.1]
[null,"Poland","Males","15 to 74 years",2014,8.6999999999999994E-2]
[null,"Poland","Males","15 to 74 years",2015,7.4999999999999997E-2]
[null,"Poland","Males","15 to 74 years",2016,6.2E-2]
[null,"Poland","Males","15 to 74 years",2017,0.05]
[null,"Poland","Males","15 to 74 years",2018,3.9E-2]
[null,"Poland","Males","15 to 74 years",2019,0.03]
[null,"Poland","Males","15 to 74 years",2020,3.1E-2]
[null,"Poland","Males","15 to 74 years",2021,3.4000000000000002E-2]
[null,"Poland","Males","15 to 74 years",2022,2.7999999999999997E-2]
[null,"Poland","Males","15 to 74 years",2023,2.7999999999999997E-2]
[null,"Poland","Males","15 to 74 years",2024,2.7000000000000003E-2]
[null,"Portugal","Males","15 to 74 years",2010,0.124]
[null,"Portugal","Males","15 to 74 years",2011,0.13200000000000001]
[null,"Portugal","Males","15 to 74 years",2012,0.16699999999999998]
[null,"Portugal","Males","15 to 74 years",2013,0.17199999999999999]
[null,"Portugal","Males","15 to 74 years",2014,0.14400000000000002]
[null,"Portugal","Males","15 to 74 years",2015,0.128]
[null,"Portugal","Males","15 to 74 years",2016,0.11599999999999999]
[null,"Portugal","Males","15 to 74 years",2017,8.8000000000000009E-2]
[null,"Portugal","Males","15 to 74 years",2018,6.9000000000000006E-2]
[null,"Portugal","Males","15 to 74 years",2019,0.06]
[null,"Portugal","Males","15 to 74 years",2020,6.9000000000000006E-2]
[null,"Portugal","Males","15 to 74 years",2021,6.5000000000000002E-2]
[null,"Portugal","Males","15 to 74 years",2022,5.7999999999999996E-2]
[null,"Portugal","Males","15 to 74 years",2023,6.2E-2]
[null,"Portugal","Males","15 to 74 years",2024,6.0999999999999999E-2]
[null,"Romania","Males","15 to 74 years",2010,9.5000000000000001E-2]
[null,"Romania","Males","15 to 74 years",2011,9.5000000000000001E-2]
[null,"Romania","Males","15 to 74 years",2012,9.1999999999999998E-2]
[null,"Romania","Males","15 to 74 years",2013,9.5000000000000001E-2]
[null,"Romania","Males","15 to 74 years",2014,9.0999999999999998E-2]
[null,"Romania","Males","15 to 74 years",2015,9.0999999999999998E-2]
[null,"Romania","Males","15 to 74 years",2016,7.9000000000000001E-2]
[null,"Romania","Males","15 to 74 years",2017,6.8000000000000005E-2]
[null,"Romania","Males","15 to 74 years",2018,5.7999999999999996E-2]
[null,"Romania","Males","15 to 74 years",2019,5.2999999999999999E-2]
[null,"Romania","Males","15 to 74 years",2020,6.3E-2]
[null,"Romania","Males","15 to 74 years",2021,0.06]
[null,"Romania","Males","15 to 74 years",2022,0.06]
[null,"Romania","Males","15 to 74 years",2023,5.9000000000000004E-2]
[null,"Romania","Males","15 to 74 years",2024,5.7000000000000002E-2]
[null,"Slovakia","Males","15 to 74 years",2010,0.13900000000000001]
[null,"Slovakia","Males","15 to 74 years",2011,0.13300000000000001]
[null,"Slovakia","Males","15 to 74 years",2012,0.13200000000000001]
[null,"Slovakia","Males","15 to 74 years",2013,0.13699999999999998]
[null,"Slovakia","Males","15 to 74 years",2014,0.125]
[null,"Slovakia","Males","15 to 74 years",2015,0.10099999999999999]
[null,"Slovakia","Males","15 to 74 years",2016,8.5999999999999993E-2]
[null,"Slovakia","Males","15 to 74 years",2017,7.6999999999999999E-2]
[null,"Slovakia","Males","15 to 74 years",2018,0.06]
[null,"Slovakia","Males","15 to 74 years",2019,5.5E-2]
[null,"Slovakia","Males","15 to 74 years",2020,6.2E-2]
[null,"Slovakia","Males","15 to 74 years",2021,6.7000000000000004E-2]
[null,"Slovakia","Males","15 to 74 years",2022,5.9000000000000004E-2]
[null,"Slovakia","Males","15 to 74 years",2023,5.7999999999999996E-2]
[null,"Slovakia","Males","15 to 74 years",2024,4.8000000000000001E-2]
[null,"Slovenia","Males","15 to 74 years",2010,7.400000000000001E-2]
[null,"Slovenia","Males","15 to 74 years",2011,8.199999999999999E-2]
[null,"Slovenia","Males","15 to 74 years",2012,8.4000000000000005E-2]
[null,"Slovenia","Males","15 to 74 years",2013,9.5000000000000001E-2]
[null,"Slovenia","Males","15 to 74 years",2014,0.09]
[null,"Slovenia","Males","15 to 74 years",2015,8.1000000000000003E-2]
[null,"Slovenia","Males","15 to 74 years",2016,7.4999999999999997E-2]
[null,"Slovenia","Males","15 to 74 years",2017,5.7999999999999996E-2]
[null,"Slovenia","Males","15 to 74 years",2018,4.5999999999999999E-2]
[null,"Slovenia","Males","15 to 74 years",2019,0.04]
[null,"Slovenia","Males","15 to 74 years",2020,4.4000000000000004E-2]
[null,"Slovenia","Males","15 to 74 years",2021,4.2999999999999997E-2]
[null,"Slovenia","Males","15 to 74 years",2022,3.7999999999999999E-2]
[null,"Slovenia","Males","15 to 74 years",2023,3.6000000000000004E-2]
[null,"Slovenia","Males","15 to 74 years",2024,3.5000000000000003E-2]
[null,"Spain","Males","15 to 74 years",2010,0.19600000000000001]
[null,"Spain","Males","15 to 74 years",2011,0.21100000000000002]
[null,"Spain","Males","15 to 74 years",2012,0.24600000000000002]
[null,"Spain","Males","15 to 74 years",2013,0.25600000000000001]
[null,"Spain","Males","15 to 74 years",2014,0.23600000000000002]
[null,"Spain","Males","15 to 74 years",2015,0.20800000000000002]
[null,"Spain","Males","15 to 74 years",2016,0.18100000000000002]
[null,"Spain","Males","15 to 74 years",2017,0.157]
[null,"Spain","Males","15 to 74 years",2018,0.13699999999999998]
[null,"Spain","Males","15 to 74 years",2019,0.125]
[null,"Spain","Males","15 to 74 years",2020,0.13900000000000001]
[null,"Spain","Males","15 to 74 years",2021,0.13200000000000001]
[null,"Spain","Males","15 to 74 years",2022,0.114]
[null,"Spain","Males","15 to 74 years",2023,0.107]
[null,"Spain","Males","15 to 74 years",2024,0.10199999999999999]
[null,"Sweden","Males","15 to 74 years",2010,8.6999999999999994E-2]
[null,"Sweden","Males","15 to 74 years",2011,7.9000000000000001E-2]
[null,"Sweden","Males","15 to 74 years",2012,8.3000000000000004E-2]
[null,"Sweden","Males","15 to 74 years",2013,8.3000000000000004E-2]
[null,"Sweden","Males","15 to 74 years",2014,8.199999999999999E-2]
[null,"Sweden","Males","15 to 74 years",2015,7.5999999999999998E-2]
[null,"Sweden","Males","15 to 74 years",2016,7.400000000000001E-2]
[null,"Sweden","Males","15 to 74 years",2017,7.0000000000000007E-2]
[null,"Sweden","Males","15 to 74 years",2018,6.5000000000000002E-2]
[null,"Sweden","Males","15 to 74 years",2019,6.7000000000000004E-2]
[null,"Sweden","Males","15 to 74 years",2020,8.5000000000000006E-2]
[null,"Sweden","Males","15 to 74 years",2021,8.5999999999999993E-2]
[null,"Sweden","Males","15 to 74 years",2022,7.0999999999999994E-2]
[null,"Sweden","Males","15 to 74 years",2023,7.4999999999999997E-2]
[null,"Sweden","Males","15 to 74 years",2024,8.3000000000000004E-2]
[null,"Austria","Males","20 to 64 years",2010,5.2999999999999999E-2]
[null,"Austria","Males","20 to 64 years",2011,4.8000000000000001E-2]
[null,"Austria","Males","20 to 64 years",2012,5.2000000000000005E-2]
[null,"Austria","Males","20 to 64 years",2013,5.7000000000000002E-2]
[null,"Austria","Males","20 to 64 years",2014,6.3E-2]
[null,"Austria","Males","20 to 64 years",2015,6.5000000000000002E-2]
[null,"Austria","Males","20 to 64 years",2016,6.8000000000000005E-2]
[null,"Austria","Males","20 to 64 years",2017,6.3E-2]
[null,"Austria","Males","20 to 64 years",2018,5.4000000000000006E-2]
[null,"Austria","Males","20 to 64 years",2019,4.9000000000000002E-2]
[null,"Austria","Males","20 to 64 years",2020,0.06]
[null,"Austria","Males","20 to 64 years",2021,0.06]
[null,"Austria","Males","20 to 64 years",2022,4.8000000000000001E-2]
[null,"Austria","Males","20 to 64 years",2023,5.0999999999999997E-2]
[null,"Austria","Males","20 to 64 years",2024,5.4000000000000006E-2]
[null,"Belgium","Males","20 to 64 years",2010,7.9000000000000001E-2]
[null,"Belgium","Males","20 to 64 years",2011,6.9000000000000006E-2]
[null,"Belgium","Males","20 to 64 years",2012,7.4999999999999997E-2]
[null,"Belgium","Males","20 to 64 years",2013,8.5999999999999993E-2]
[null,"Belgium","Males","20 to 64 years",2014,0.09]
[null,"Belgium","Males","20 to 64 years",2015,9.1999999999999998E-2]
[null,"Belgium","Males","20 to 64 years",2016,0.08]
[null,"Belgium","Males","20 to 64 years",2017,7.0000000000000007E-2]
[null,"Belgium","Males","20 to 64 years",2018,6.3E-2]
[null,"Belgium","Males","20 to 64 years",2019,5.7000000000000002E-2]
[null,"Belgium","Males","20 to 64 years",2020,5.7999999999999996E-2]
[null,"Belgium","Males","20 to 64 years",2021,6.3E-2]
[null,"Belgium","Males","20 to 64 years",2022,5.5999999999999994E-2]
[null,"Belgium","Males","20 to 64 years",2023,5.7000000000000002E-2]
[null,"Belgium","Males","20 to 64 years",2024,5.7999999999999996E-2]
[null,"Bulgaria","Males","20 to 64 years",2010,0.11800000000000001]
[null,"Bulgaria","Males","20 to 64 years",2011,0.13200000000000001]
[null,"Bulgaria","Males","20 to 64 years",2012,0.14400000000000002]
[null,"Bulgaria","Males","20 to 64 years",2013,0.14699999999999999]
[null,"Bulgaria","Males","20 to 64 years",2014,0.13400000000000001]
[null,"Bulgaria","Males","20 to 64 years",2015,0.10800000000000001]
[null,"Bulgaria","Males","20 to 64 years",2016,9.1999999999999998E-2]
[null,"Bulgaria","Males","20 to 64 years",2017,7.400000000000001E-2]
[null,"Bulgaria","Males","20 to 64 years",2018,6.7000000000000004E-2]
[null,"Bulgaria","Males","20 to 64 years",2019,5.5999999999999994E-2]
[null,"Bulgaria","Males","20 to 64 years",2020,6.5000000000000002E-2]
[null,"Bulgaria","Males","20 to 64 years",2021,5.2999999999999999E-2]
[null,"Bulgaria","Males","20 to 64 years",2022,4.2999999999999997E-2]
[null,"Bulgaria","Males","20 to 64 years",2023,4.2999999999999997E-2]
[null,"Bulgaria","Males","20 to 64 years",2024,4.2999999999999997E-2]
[null,"Croatia","Males","20 to 64 years",2010,0.10400000000000001]
[null,"Croatia","Males","20 to 64 years",2011,0.13200000000000001]
[null,"Croatia","Males","20 to 64 years",2012,0.157]
[null,"Croatia","Males","20 to 64 years",2013,0.17100000000000001]
[null,"Croatia","Males","20 to 64 years",2014,0.157]
[null,"Croatia","Males","20 to 64 years",2015,0.14800000000000002]
[null,"Croatia","Males","20 to 64 years",2016,0.11699999999999999]
[null,"Croatia","Males","20 to 64 years",2017,9.9000000000000005E-2]
[null,"Croatia","Males","20 to 64 years",2018,7.2000000000000008E-2]
[null,"Croatia","Males","20 to 64 years",2019,5.9000000000000004E-2]
[null,"Croatia","Males","20 to 64 years",2020,6.9000000000000006E-2]
[null,"Croatia","Males","20 to 64 years",2021,6.8000000000000005E-2]
[null,"Croatia","Males","20 to 64 years",2022,5.7000000000000002E-2]
[null,"Croatia","Males","20 to 64 years",2023,5.2999999999999999E-2]
[null,"Croatia","Males","20 to 64 years",2024,4.8000000000000001E-2]
[null,"Cyprus","Males","20 to 64 years",2010,6.2E-2]
[null,"Cyprus","Males","20 to 64 years",2011,8.199999999999999E-2]
[null,"Cyprus","Males","20 to 64 years",2012,0.125]
[null,"Cyprus","Males","20 to 64 years",2013,0.16500000000000001]
[null,"Cyprus","Males","20 to 64 years",2014,0.17100000000000001]
[null,"Cyprus","Males","20 to 64 years",2015,0.152]
[null,"Cyprus","Males","20 to 64 years",2016,0.128]
[null,"Cyprus","Males","20 to 64 years",2017,0.11]
[null,"Cyprus","Males","20 to 64 years",2018,8.1000000000000003E-2]
[null,"Cyprus","Males","20 to 64 years",2019,6.7000000000000004E-2]
[null,"Cyprus","Males","20 to 64 years",2020,7.8E-2]
[null,"Cyprus","Males","20 to 64 years",2021,7.0999999999999994E-2]
[null,"Cyprus","Males","20 to 64 years",2022,5.7000000000000002E-2]
[null,"Cyprus","Males","20 to 64 years",2023,5.7999999999999996E-2]
[null,"Cyprus","Males","20 to 64 years",2024,4.7E-2]
[null,"Czechia","Males","20 to 64 years",2010,6.2E-2]
[null,"Czechia","Males","20 to 64 years",2011,5.5999999999999994E-2]
[null,"Czechia","Males","20 to 64 years",2012,5.7999999999999996E-2]
[null,"Czechia","Males","20 to 64 years",2013,5.7999999999999996E-2]
[null,"Czechia","Males","20 to 64 years",2014,0.05]
[null,"Czechia","Males","20 to 64 years",2015,4.0999999999999995E-2]
[null,"Czechia","Males","20 to 64 years",2016,3.3000000000000002E-2]
[null,"Czechia","Males","20 to 64 years",2017,2.3E-2]
[null,"Czechia","Males","20 to 64 years",2018,1.7000000000000001E-2]
[null,"Czechia","Males","20 to 64 years",2019,1.7000000000000001E-2]
[null,"Czechia","Males","20 to 64 years",2020,2.2000000000000002E-2]
[null,"Czechia","Males","20 to 64 years",2021,2.2000000000000002E-2]
[null,"Czechia","Males","20 to 64 years",2022,1.7000000000000001E-2]
[null,"Czechia","Males","20 to 64 years",2023,2.1000000000000001E-2]
[null,"Czechia","Males","20 to 64 years",2024,2.1000000000000001E-2]
[null,"Denmark","Males","20 to 64 years",2010,0.08]
[null,"Denmark","Males","20 to 64 years",2011,7.0999999999999994E-2]
[null,"Denmark","Males","20 to 64 years",2012,7.2000000000000008E-2]
[null,"Denmark","Males","20 to 64 years",2013,6.5000000000000002E-2]
[null,"Denmark","Males","20 to 64 years",2014,6.2E-2]
[null,"Denmark","Males","20 to 64 years",2015,5.7000000000000002E-2]
[null,"Denmark","Males","20 to 64 years",2016,5.2000000000000005E-2]
[null,"Denmark","Males","20 to 64 years",2017,5.0999999999999997E-2]
[null,"Denmark","Males","20 to 64 years",2018,4.4999999999999998E-2]
[null,"Denmark","Males","20 to 64 years",2019,4.4999999999999998E-2]
[null,"Denmark","Males","20 to 64 years",2020,4.9000000000000002E-2]
[null,"Denmark","Males","20 to 64 years",2021,4.5999999999999999E-2]
[null,"Denmark","Males","20 to 64 years",2022,0.04]
[null,"Denmark","Males","20 to 64 years",2023,4.5999999999999999E-2]
[null,"Denmark","Males","20 to 64 years",2024,5.2000000000000005E-2]
[null,"Estonia","Males","20 to 64 years",2010,0.191]
[null,"Estonia","Males","20 to 64 years",2011,0.128]
[null,"Estonia","Males","20 to 64 years",2012,0.107]
[null,"Estonia","Males","20 to 64 years",2013,0.09]
[null,"Estonia","Males","20 to 64 years",2014,7.6999999999999999E-2]
[null,"Estonia","Males","20 to 64 years",2015,6.4000000000000001E-2]
[null,"Estonia","Males","20 to 64 years",2016,7.400000000000001E-2]
[null,"Estonia","Males","20 to 64 years",2017,6.2E-2]
[null,"Estonia","Males","20 to 64 years",2018,5.2000000000000005E-2]
[null,"Estonia","Males","20 to 64 years",2019,3.9E-2]
[null,"Estonia","Males","20 to 64 years",2020,6.8000000000000005E-2]
[null,"Estonia","Males","20 to 64 years",2021,6.7000000000000004E-2]
[null,"Estonia","Males","20 to 64 years",2022,5.9000000000000004E-2]
[null,"Estonia","Males","20 to 64 years",2023,5.7999999999999996E-2]
[null,"Estonia","Males","20 to 64 years",2024,7.2999999999999995E-2]
[null,"Finland","Males","20 to 64 years",2010,8.6999999999999994E-2]
[null,"Finland","Males","20 to 64 years",2011,8.199999999999999E-2]
[null,"Finland","Males","20 to 64 years",2012,0.08]
[null,"Finland","Males","20 to 64 years",2013,8.5000000000000006E-2]
[null,"Finland","Males","20 to 64 years",2014,9.0999999999999998E-2]
[null,"Finland","Males","20 to 64 years",2015,9.8000000000000004E-2]
[null,"Finland","Males","20 to 64 years",2016,8.900000000000001E-2]
[null,"Finland","Males","20 to 64 years",2017,8.6999999999999994E-2]
[null,"Finland","Males","20 to 64 years",2018,7.2999999999999995E-2]
[null,"Finland","Males","20 to 64 years",2019,6.7000000000000004E-2]
[null,"Finland","Males","20 to 64 years",2020,7.5999999999999998E-2]
[null,"Finland","Males","20 to 64 years",2021,7.8E-2]
[null,"Finland","Males","20 to 64 years",2022,6.9000000000000006E-2]
[null,"Finland","Males","20 to 64 years",2023,7.4999999999999997E-2]
[null,"Finland","Males","20 to 64 years",2024,8.6999999999999994E-2]
[null,"France","Males","20 to 64 years",2010,8.5999999999999993E-2]
[null,"France","Males","20 to 64 years",2011,8.5000000000000006E-2]
[null,"France","Males","20 to 64 years",2012,9.3000000000000013E-2]
[null,"France","Males","20 to 64 years",2013,0.1]
[null,"France","Males","20 to 64 years",2014,0.10099999999999999]
[null,"France","Males","20 to 64 years",2015,0.10300000000000001]
[null,"France","Males","20 to 64 years",2016,9.8000000000000004E-2]
[null,"France","Males","20 to 64 years",2017,9.0999999999999998E-2]
[null,"France","Males","20 to 64 years",2018,8.6999999999999994E-2]
[null,"France","Males","20 to 64 years",2019,8.199999999999999E-2]
[null,"France","Males","20 to 64 years",2020,7.6999999999999999E-2]
[null,"France","Males","20 to 64 years",2021,7.6999999999999999E-2]
[null,"France","Males","20 to 64 years",2022,7.0999999999999994E-2]
[null,"France","Males","20 to 64 years",2023,7.0999999999999994E-2]
[null,"France","Males","20 to 64 years",2024,7.0999999999999994E-2]
[null,"Germany","Males","20 to 64 years",2010,7.0000000000000007E-2]
[null,"Germany","Males","20 to 64 years",2011,5.7000000000000002E-2]
[null,"Germany","Males","20 to 64 years",2012,5.2000000000000005E-2]
[null,"Germany","Males","20 to 64 years",2013,5.2000000000000005E-2]
[null,"Germany","Males","20 to 64 years",2014,0.05]
[null,"Germany","Males","20 to 64 years",2015,4.7E-2]
[null,"Germany","Males","20 to 64 years",2016,4.2000000000000003E-2]
[null,"Germany","Males","20 to 64 years",2017,3.7999999999999999E-2]
[null,"Germany","Males","20 to 64 years",2018,3.5000000000000003E-2]
[null,"Germany","Males","20 to 64 years",2019,3.2000000000000001E-2]
[null,"Germany","Males","20 to 64 years",2020,3.9E-2]
[null,"Germany","Males","20 to 64 years",2021,3.9E-2]
[null,"Germany","Males","20 to 64 years",2022,3.3000000000000002E-2]
[null,"Germany","Males","20 to 64 years",2023,3.2000000000000001E-2]
[null,"Germany","Males","20 to 64 years",2024,3.5000000000000003E-2]
[null,"Greece","Males","20 to 64 years",2010,0.10099999999999999]
[null,"Greece","Males","20 to 64 years",2011,0.152]
[null,"Greece","Males","20 to 64 years",2012,0.218]
[null,"Greece","Males","20 to 64 years",2013,0.24600000000000002]
[null,"Greece","Males","20 to 64 years",2014,0.23600000000000002]
[null,"Greece","Males","20 to 64 years",2015,0.218]
[null,"Greece","Males","20 to 64 years",2016,0.2]
[null,"Greece","Males","20 to 64 years",2017,0.18100000000000002]
[null,"Greece","Males","20 to 64 years",2018,0.157]
[null,"Greece","Males","20 to 64 years",2019,0.14300000000000002]
[null,"Greece","Males","20 to 64 years",2020,0.14599999999999999]
[null,"Greece","Males","20 to 64 years",2021,0.11199999999999999]
[null,"Greece","Males","20 to 64 years",2022,9.0999999999999998E-2]
[null,"Greece","Males","20 to 64 years",2023,8.3000000000000004E-2]
[null,"Greece","Males","20 to 64 years",2024,0.08]
[null,"Hungary","Males","20 to 64 years",2010,0.115]
[null,"Hungary","Males","20 to 64 years",2011,0.11]
[null,"Hungary","Males","20 to 64 years",2012,0.11199999999999999]
[null,"Hungary","Males","20 to 64 years",2013,0.1]
[null,"Hungary","Males","20 to 64 years",2014,7.400000000000001E-2]
[null,"Hungary","Males","20 to 64 years",2015,6.5000000000000002E-2]
[null,"Hungary","Males","20 to 64 years",2016,0.05]
[null,"Hungary","Males","20 to 64 years",2017,3.7000000000000005E-2]
[null,"Hungary","Males","20 to 64 years",2018,3.3000000000000002E-2]
[null,"Hungary","Males","20 to 64 years",2019,3.2000000000000001E-2]
[null,"Hungary","Males","20 to 64 years",2020,0.04]
[null,"Hungary","Males","20 to 64 years",2021,3.7000000000000005E-2]
[null,"Hungary","Males","20 to 64 years",2022,3.6000000000000004E-2]
[null,"Hungary","Males","20 to 64 years",2023,3.9E-2]
[null,"Hungary","Males","20 to 64 years",2024,4.4000000000000004E-2]
[null,"Ireland","Males","20 to 64 years",2010,0.16699999999999998]
[null,"Ireland","Males","20 to 64 years",2011,0.17300000000000001]
[null,"Ireland","Males","20 to 64 years",2012,0.17300000000000001]
[null,"Ireland","Males","20 to 64 years",2013,0.14499999999999999]
[null,"Ireland","Males","20 to 64 years",2014,0.124]
[null,"Ireland","Males","20 to 64 years",2015,0.10400000000000001]
[null,"Ireland","Males","20 to 64 years",2016,8.8000000000000009E-2]
[null,"Ireland","Males","20 to 64 years",2017,6.9000000000000006E-2]
[null,"Ireland","Males","20 to 64 years",2018,5.5E-2]
[null,"Ireland","Males","20 to 64 years",2019,4.9000000000000002E-2]
[null,"Ireland","Males","20 to 64 years",2020,5.5E-2]
[null,"Ireland","Males","20 to 64 years",2021,0.06]
[null,"Ireland","Males","20 to 64 years",2022,4.0999999999999995E-2]
[null,"Ireland","Males","20 to 64 years",2023,4.0999999999999995E-2]
[null,"Ireland","Males","20 to 64 years",2024,3.9E-2]
[null,"Italy","Males","20 to 64 years",2010,7.400000000000001E-2]
[null,"Italy","Males","20 to 64 years",2011,7.4999999999999997E-2]
[null,"Italy","Males","20 to 64 years",2012,9.8000000000000004E-2]
[null,"Italy","Males","20 to 64 years",2013,0.115]
[null,"Italy","Males","20 to 64 years",2014,0.11900000000000001]
[null,"Italy","Males","20 to 64 years",2015,0.113]
[null,"Italy","Males","20 to 64 years",2016,0.10800000000000001]
[null,"Italy","Males","20 to 64 years",2017,0.10300000000000001]
[null,"Italy","Males","20 to 64 years",2018,9.6000000000000002E-2]
[null,"Italy","Males","20 to 64 years",2019,0.09]
[null,"Italy","Males","20 to 64 years",2020,8.5000000000000006E-2]
[null,"Italy","Males","20 to 64 years",2021,8.5000000000000006E-2]
[null,"Italy","Males","20 to 64 years",2022,7.0000000000000007E-2]
[null,"Italy","Males","20 to 64 years",2023,6.7000000000000004E-2]
[null,"Italy","Males","20 to 64 years",2024,5.7999999999999996E-2]
[null,"Latvia","Males","20 to 64 years",2010,0.22699999999999998]
[null,"Latvia","Males","20 to 64 years",2011,0.187]
[null,"Latvia","Males","20 to 64 years",2012,0.16]
[null,"Latvia","Males","20 to 64 years",2013,0.127]
[null,"Latvia","Males","20 to 64 years",2014,0.11900000000000001]
[null,"Latvia","Males","20 to 64 years",2015,0.11199999999999999]
[null,"Latvia","Males","20 to 64 years",2016,0.111]
[null,"Latvia","Males","20 to 64 years",2017,9.6999999999999989E-2]
[null,"Latvia","Males","20 to 64 years",2018,8.5000000000000006E-2]
[null,"Latvia","Males","20 to 64 years",2019,7.2000000000000008E-2]
[null,"Latvia","Males","20 to 64 years",2020,9.3000000000000013E-2]
[null,"Latvia","Males","20 to 64 years",2021,8.5999999999999993E-2]
[null,"Latvia","Males","20 to 64 years",2022,8.1000000000000003E-2]
[null,"Latvia","Males","20 to 64 years",2023,7.6999999999999999E-2]
[null,"Latvia","Males","20 to 64 years",2024,8.199999999999999E-2]
[null,"Lithuania","Males","20 to 64 years",2010,0.21199999999999999]
[null,"Lithuania","Males","20 to 64 years",2011,0.17899999999999999]
[null,"Lithuania","Males","20 to 64 years",2012,0.153]
[null,"Lithuania","Males","20 to 64 years",2013,0.13200000000000001]
[null,"Lithuania","Males","20 to 64 years",2014,0.12300000000000001]
[null,"Lithuania","Males","20 to 64 years",2015,0.10199999999999999]
[null,"Lithuania","Males","20 to 64 years",2016,9.1999999999999998E-2]
[null,"Lithuania","Males","20 to 64 years",2017,8.6999999999999994E-2]
[null,"Lithuania","Males","20 to 64 years",2018,7.0000000000000007E-2]
[null,"Lithuania","Males","20 to 64 years",2019,7.0999999999999994E-2]
[null,"Lithuania","Males","20 to 64 years",2020,9.5000000000000001E-2]
[null,"Lithuania","Males","20 to 64 years",2021,7.8E-2]
[null,"Lithuania","Males","20 to 64 years",2022,6.6000000000000003E-2]
[null,"Lithuania","Males","20 to 64 years",2023,7.400000000000001E-2]
[null,"Lithuania","Males","20 to 64 years",2024,7.6999999999999999E-2]
[null,"Luxembourg","Males","20 to 64 years",2010,3.5000000000000003E-2]
[null,"Luxembourg","Males","20 to 64 years",2011,3.7000000000000005E-2]
[null,"Luxembourg","Males","20 to 64 years",2012,4.2999999999999997E-2]
[null,"Luxembourg","Males","20 to 64 years",2013,5.2000000000000005E-2]
[null,"Luxembourg","Males","20 to 64 years",2014,5.5999999999999994E-2]
[null,"Luxembourg","Males","20 to 64 years",2015,5.7000000000000002E-2]
[null,"Luxembourg","Males","20 to 64 years",2016,5.5999999999999994E-2]
[null,"Luxembourg","Males","20 to 64 years",2017,5.4000000000000006E-2]
[null,"Luxembourg","Males","20 to 64 years",2018,0.05]
[null,"Luxembourg","Males","20 to 64 years",2019,5.2999999999999999E-2]
[null,"Luxembourg","Males","20 to 64 years",2020,6.3E-2]
[null,"Luxembourg","Males","20 to 64 years",2021,4.4000000000000004E-2]
[null,"Luxembourg","Males","20 to 64 years",2022,0.04]
[null,"Luxembourg","Males","20 to 64 years",2023,4.5999999999999999E-2]
[null,"Luxembourg","Males","20 to 64 years",2024,5.9000000000000004E-2]
[null,"Malta","Males","20 to 64 years",2010,0.06]
[null,"Malta","Males","20 to 64 years",2011,5.2999999999999999E-2]
[null,"Malta","Males","20 to 64 years",2012,4.9000000000000002E-2]
[null,"Malta","Males","20 to 64 years",2013,5.5E-2]
[null,"Malta","Males","20 to 64 years",2014,5.7999999999999996E-2]
[null,"Malta","Males","20 to 64 years",2015,0.05]
[null,"Malta","Males","20 to 64 years",2016,0.04]
[null,"Malta","Males","20 to 64 years",2017,3.5000000000000003E-2]
[null,"Malta","Males","20 to 64 years",2018,3.7999999999999999E-2]
[null,"Malta","Males","20 to 64 years",2019,3.3000000000000002E-2]
[null,"Malta","Males","20 to 64 years",2020,4.4000000000000004E-2]
[null,"Malta","Males","20 to 64 years",2021,3.7000000000000005E-2]
[null,"Malta","Males","20 to 64 years",2022,3.5000000000000003E-2]
[null,"Malta","Males","20 to 64 years",2023,3.3000000000000002E-2]
[null,"Malta","Males","20 to 64 years",2024,0.03]
[null,"Netherlands","Males","20 to 64 years",2010,4.7E-2]
[null,"Netherlands","Males","20 to 64 years",2011,4.8000000000000001E-2]
[null,"Netherlands","Males","20 to 64 years",2012,5.5999999999999994E-2]
[null,"Netherlands","Males","20 to 64 years",2013,7.400000000000001E-2]
[null,"Netherlands","Males","20 to 64 years",2014,7.2999999999999995E-2]
[null,"Netherlands","Males","20 to 64 years",2015,6.8000000000000005E-2]
[null,"Netherlands","Males","20 to 64 years",2016,5.7000000000000002E-2]
[null,"Netherlands","Males","20 to 64 years",2017,4.7E-2]
[null,"Netherlands","Males","20 to 64 years",2018,4.0999999999999995E-2]
[null,"Netherlands","Males","20 to 64 years",2019,3.7000000000000005E-2]
[null,"Netherlands","Males","20 to 64 years",2020,0.04]
[null,"Netherlands","Males","20 to 64 years",2021,3.3000000000000002E-2]
[null,"Netherlands","Males","20 to 64 years",2022,2.7000000000000003E-2]
[null,"Netherlands","Males","20 to 64 years",2023,2.7000000000000003E-2]
[null,"Netherlands","Males","20 to 64 years",2024,2.8999999999999998E-2]
[null,"Poland","Males","20 to 64 years",2010,9.5000000000000001E-2]
[null,"Poland","Males","20 to 64 years",2011,9.1999999999999998E-2]
[null,"Poland","Males","20 to 64 years",2012,9.6000000000000002E-2]
[null,"Poland","Males","20 to 64 years",2013,9.9000000000000005E-2]
[null,"Poland","Males","20 to 64 years",2014,8.5999999999999993E-2]
[null,"Poland","Males","20 to 64 years",2015,7.400000000000001E-2]
[null,"Poland","Males","20 to 64 years",2016,6.0999999999999999E-2]
[null,"Poland","Males","20 to 64 years",2017,4.9000000000000002E-2]
[null,"Poland","Males","20 to 64 years",2018,3.7999999999999999E-2]
[null,"Poland","Males","20 to 64 years",2019,0.03]
[null,"Poland","Males","20 to 64 years",2020,3.1E-2]
[null,"Poland","Males","20 to 64 years",2021,3.4000000000000002E-2]
[null,"Poland","Males","20 to 64 years",2022,2.7999999999999997E-2]
[null,"Poland","Males","20 to 64 years",2023,2.7000000000000003E-2]
[null,"Poland","Males","20 to 64 years",2024,2.7000000000000003E-2]
[null,"Portugal","Males","20 to 64 years",2010,0.12]
[null,"Portugal","Males","20 to 64 years",2011,0.129]
[null,"Portugal","Males","20 to 64 years",2012,0.16399999999999998]
[null,"Portugal","Males","20 to 64 years",2013,0.17]
[null,"Portugal","Males","20 to 64 years",2014,0.14099999999999999]
[null,"Portugal","Males","20 to 64 years",2015,0.126]
[null,"Portugal","Males","20 to 64 years",2016,0.115]
[null,"Portugal","Males","20 to 64 years",2017,8.5999999999999993E-2]
[null,"Portugal","Males","20 to 64 years",2018,6.6000000000000003E-2]
[null,"Portugal","Males","20 to 64 years",2019,5.9000000000000004E-2]
[null,"Portugal","Males","20 to 64 years",2020,6.8000000000000005E-2]
[null,"Portugal","Males","20 to 64 years",2021,6.5000000000000002E-2]
[null,"Portugal","Males","20 to 64 years",2022,5.7000000000000002E-2]
[null,"Portugal","Males","20 to 64 years",2023,0.06]
[null,"Portugal","Males","20 to 64 years",2024,5.9000000000000004E-2]
[null,"Romania","Males","20 to 64 years",2010,9.3000000000000013E-2]
[null,"Romania","Males","20 to 64 years",2011,9.1999999999999998E-2]
[null,"Romania","Males","20 to 64 years",2012,8.8000000000000009E-2]
[null,"Romania","Males","20 to 64 years",2013,9.1999999999999998E-2]
[null,"Romania","Males","20 to 64 years",2014,8.6999999999999994E-2]
[null,"Romania","Males","20 to 64 years",2015,8.8000000000000009E-2]
[null,"Romania","Males","20 to 64 years",2016,7.5999999999999998E-2]
[null,"Romania","Males","20 to 64 years",2017,6.6000000000000003E-2]
[null,"Romania","Males","20 to 64 years",2018,5.5E-2]
[null,"Romania","Males","20 to 64 years",2019,0.05]
[null,"Romania","Males","20 to 64 years",2020,0.06]
[null,"Romania","Males","20 to 64 years",2021,5.5999999999999994E-2]
[null,"Romania","Males","20 to 64 years",2022,5.5999999999999994E-2]
[null,"Romania","Males","20 to 64 years",2023,5.5E-2]
[null,"Romania","Males","20 to 64 years",2024,5.2000000000000005E-2]
[null,"Slovakia","Males","20 to 64 years",2010,0.13600000000000001]
[null,"Slovakia","Males","20 to 64 years",2011,0.129]
[null,"Slovakia","Males","20 to 64 years",2012,0.129]
[null,"Slovakia","Males","20 to 64 years",2013,0.13400000000000001]
[null,"Slovakia","Males","20 to 64 years",2014,0.12300000000000001]
[null,"Slovakia","Males","20 to 64 years",2015,9.9000000000000005E-2]
[null,"Slovakia","Males","20 to 64 years",2016,8.3000000000000004E-2]
[null,"Slovakia","Males","20 to 64 years",2017,7.4999999999999997E-2]
[null,"Slovakia","Males","20 to 64 years",2018,5.7999999999999996E-2]
[null,"Slovakia","Males","20 to 64 years",2019,5.2999999999999999E-2]
[null,"Slovakia","Males","20 to 64 years",2020,6.0999999999999999E-2]
[null,"Slovakia","Males","20 to 64 years",2021,6.6000000000000003E-2]
[null,"Slovakia","Males","20 to 64 years",2022,5.7000000000000002E-2]
[null,"Slovakia","Males","20 to 64 years",2023,5.5999999999999994E-2]
[null,"Slovakia","Males","20 to 64 years",2024,4.4999999999999998E-2]
[null,"Slovenia","Males","20 to 64 years",2010,7.400000000000001E-2]
[null,"Slovenia","Males","20 to 64 years",2011,8.3000000000000004E-2]
[null,"Slovenia","Males","20 to 64 years",2012,8.4000000000000005E-2]
[null,"Slovenia","Males","20 to 64 years",2013,9.6000000000000002E-2]
[null,"Slovenia","Males","20 to 64 years",2014,9.0999999999999998E-2]
[null,"Slovenia","Males","20 to 64 years",2015,8.1000000000000003E-2]
[null,"Slovenia","Males","20 to 64 years",2016,7.4999999999999997E-2]
[null,"Slovenia","Males","20 to 64 years",2017,5.7999999999999996E-2]
[null,"Slovenia","Males","20 to 64 years",2018,4.5999999999999999E-2]
[null,"Slovenia","Males","20 to 64 years",2019,3.9E-2]
[null,"Slovenia","Males","20 to 64 years",2020,4.4000000000000004E-2]
[null,"Slovenia","Males","20 to 64 years",2021,4.2000000000000003E-2]
[null,"Slovenia","Males","20 to 64 years",2022,3.6000000000000004E-2]
[null,"Slovenia","Males","20 to 64 years",2023,3.4000000000000002E-2]
[null,"Slovenia","Males","20 to 64 years",2024,3.1E-2]
[null,"Spain","Males","20 to 64 years",2010,0.18899999999999997]
[null,"Spain","Males","20 to 64 years",2011,0.20499999999999999]
[null,"Spain","Males","20 to 64 years",2012,0.24100000000000002]
[null,"Spain","Males","20 to 64 years",2013,0.251]
[null,"Spain","Males","20 to 64 years",2014,0.23199999999999998]
[null,"Spain","Males","20 to 64 years",2015,0.20399999999999999]
[null,"Spain","Males","20 to 64 years",2016,0.17800000000000002]
[null,"Spain","Males","20 to 64 years",2017,0.153]
[null,"Spain","Males","20 to 64 years",2018,0.13400000000000001]
[null,"Spain","Males","20 to 64 years",2019,0.121]
[null,"Spain","Males","20 to 64 years",2020,0.13600000000000001]
[null,"Spain","Males","20 to 64 years",2021,0.129]
[null,"Spain","Males","20 to 64 years",2022,0.11]
[null,"Spain","Males","20 to 64 years",2023,0.10300000000000001]
[null,"Spain","Males","20 to 64 years",2024,9.8000000000000004E-2]
[null,"Sweden","Males","20 to 64 years",2010,7.9000000000000001E-2]
[null,"Sweden","Males","20 to 64 years",2011,7.0999999999999994E-2]
[null,"Sweden","Males","20 to 64 years",2012,7.5999999999999998E-2]
[null,"Sweden","Males","20 to 64 years",2013,7.4999999999999997E-2]
[null,"Sweden","Males","20 to 64 years",2014,7.4999999999999997E-2]
[null,"Sweden","Males","20 to 64 years",2015,7.0000000000000007E-2]
[null,"Sweden","Males","20 to 64 years",2016,6.8000000000000005E-2]
[null,"Sweden","Males","20 to 64 years",2017,6.4000000000000001E-2]
[null,"Sweden","Males","20 to 64 years",2018,5.9000000000000004E-2]
[null,"Sweden","Males","20 to 64 years",2019,0.06]
[null,"Sweden","Males","20 to 64 years",2020,7.8E-2]
[null,"Sweden","Males","20 to 64 years",2021,7.8E-2]
[null,"Sweden","Males","20 to 64 years",2022,0.06]
[null,"Sweden","Males","20 to 64 years",2023,6.4000000000000001E-2]
[null,"Sweden","Males","20 to 64 years",2024,7.0999999999999994E-2]
[null,"Austria","Males","25 to 54 years",2010,0.05]
[null,"Austria","Males","25 to 54 years",2011,4.2999999999999997E-2]
[null,"Austria","Males","25 to 54 years",2012,4.7E-2]
[null,"Austria","Males","25 to 54 years",2013,5.5E-2]
[null,"Austria","Males","25 to 54 years",2014,5.7999999999999996E-2]
[null,"Austria","Males","25 to 54 years",2015,5.9000000000000004E-2]
[null,"Austria","Males","25 to 54 years",2016,6.2E-2]
[null,"Austria","Males","25 to 54 years",2017,0.06]
[null,"Austria","Males","25 to 54 years",2018,5.0999999999999997E-2]
[null,"Austria","Males","25 to 54 years",2019,4.5999999999999999E-2]
[null,"Austria","Males","25 to 54 years",2020,5.5E-2]
[null,"Austria","Males","25 to 54 years",2021,5.7999999999999996E-2]
[null,"Austria","Males","25 to 54 years",2022,4.4000000000000004E-2]
[null,"Austria","Males","25 to 54 years",2023,4.7E-2]
[null,"Austria","Males","25 to 54 years",2024,5.0999999999999997E-2]
[null,"Belgium","Males","25 to 54 years",2010,7.2999999999999995E-2]
[null,"Belgium","Males","25 to 54 years",2011,6.5000000000000002E-2]
[null,"Belgium","Males","25 to 54 years",2012,6.9000000000000006E-2]
[null,"Belgium","Males","25 to 54 years",2013,7.6999999999999999E-2]
[null,"Belgium","Males","25 to 54 years",2014,8.3000000000000004E-2]
[null,"Belgium","Males","25 to 54 years",2015,8.3000000000000004E-2]
[null,"Belgium","Males","25 to 54 years",2016,7.400000000000001E-2]
[null,"Belgium","Males","25 to 54 years",2017,6.3E-2]
[null,"Belgium","Males","25 to 54 years",2018,5.7999999999999996E-2]
[null,"Belgium","Males","25 to 54 years",2019,5.2000000000000005E-2]
[null,"Belgium","Males","25 to 54 years",2020,5.2999999999999999E-2]
[null,"Belgium","Males","25 to 54 years",2021,5.7000000000000002E-2]
[null,"Belgium","Males","25 to 54 years",2022,5.0999999999999997E-2]
[null,"Belgium","Males","25 to 54 years",2023,5.2999999999999999E-2]
[null,"Belgium","Males","25 to 54 years",2024,5.2999999999999999E-2]
[null,"Bulgaria","Males","25 to 54 years",2010,0.109]
[null,"Bulgaria","Males","25 to 54 years",2011,0.126]
[null,"Bulgaria","Males","25 to 54 years",2012,0.13400000000000001]
[null,"Bulgaria","Males","25 to 54 years",2013,0.13600000000000001]
[null,"Bulgaria","Males","25 to 54 years",2014,0.124]
[null,"Bulgaria","Males","25 to 54 years",2015,0.10099999999999999]
[null,"Bulgaria","Males","25 to 54 years",2016,8.6999999999999994E-2]
[null,"Bulgaria","Males","25 to 54 years",2017,7.0000000000000007E-2]
[null,"Bulgaria","Males","25 to 54 years",2018,6.4000000000000001E-2]
[null,"Bulgaria","Males","25 to 54 years",2019,5.5999999999999994E-2]
[null,"Bulgaria","Males","25 to 54 years",2020,6.4000000000000001E-2]
[null,"Bulgaria","Males","25 to 54 years",2021,0.05]
[null,"Bulgaria","Males","25 to 54 years",2022,4.0999999999999995E-2]
[null,"Bulgaria","Males","25 to 54 years",2023,4.2000000000000003E-2]
[null,"Bulgaria","Males","25 to 54 years",2024,4.2999999999999997E-2]
[null,"Croatia","Males","25 to 54 years",2010,9.1999999999999998E-2]
[null,"Croatia","Males","25 to 54 years",2011,0.12]
[null,"Croatia","Males","25 to 54 years",2012,0.14499999999999999]
[null,"Croatia","Males","25 to 54 years",2013,0.155]
[null,"Croatia","Males","25 to 54 years",2014,0.13900000000000001]
[null,"Croatia","Males","25 to 54 years",2015,0.13200000000000001]
[null,"Croatia","Males","25 to 54 years",2016,0.10400000000000001]
[null,"Croatia","Males","25 to 54 years",2017,9.0999999999999998E-2]
[null,"Croatia","Males","25 to 54 years",2018,6.8000000000000005E-2]
[null,"Croatia","Males","25 to 54 years",2019,5.7999999999999996E-2]
[null,"Croatia","Males","25 to 54 years",2020,6.7000000000000004E-2]
[null,"Croatia","Males","25 to 54 years",2021,6.6000000000000003E-2]
[null,"Croatia","Males","25 to 54 years",2022,5.2999999999999999E-2]
[null,"Croatia","Males","25 to 54 years",2023,4.9000000000000002E-2]
[null,"Croatia","Males","25 to 54 years",2024,4.4999999999999998E-2]
[null,"Cyprus","Males","25 to 54 years",2010,5.5E-2]
[null,"Cyprus","Males","25 to 54 years",2011,7.2000000000000008E-2]
[null,"Cyprus","Males","25 to 54 years",2012,0.11199999999999999]
[null,"Cyprus","Males","25 to 54 years",2013,0.14400000000000002]
[null,"Cyprus","Males","25 to 54 years",2014,0.14800000000000002]
[null,"Cyprus","Males","25 to 54 years",2015,0.129]
[null,"Cyprus","Males","25 to 54 years",2016,0.114]
[null,"Cyprus","Males","25 to 54 years",2017,0.1]
[null,"Cyprus","Males","25 to 54 years",2018,7.0000000000000007E-2]
[null,"Cyprus","Males","25 to 54 years",2019,5.9000000000000004E-2]
[null,"Cyprus","Males","25 to 54 years",2020,7.0000000000000007E-2]
[null,"Cyprus","Males","25 to 54 years",2021,6.7000000000000004E-2]
[null,"Cyprus","Males","25 to 54 years",2022,5.0999999999999997E-2]
[null,"Cyprus","Males","25 to 54 years",2023,5.0999999999999997E-2]
[null,"Cyprus","Males","25 to 54 years",2024,4.4999999999999998E-2]
[null,"Czechia","Males","25 to 54 years",2010,5.2000000000000005E-2]
[null,"Czechia","Males","25 to 54 years",2011,4.5999999999999999E-2]
[null,"Czechia","Males","25 to 54 years",2012,4.8000000000000001E-2]
[null,"Czechia","Males","25 to 54 years",2013,4.9000000000000002E-2]
[null,"Czechia","Males","25 to 54 years",2014,4.2999999999999997E-2]
[null,"Czechia","Males","25 to 54 years",2015,3.7000000000000005E-2]
[null,"Czechia","Males","25 to 54 years",2016,2.7999999999999997E-2]
[null,"Czechia","Males","25 to 54 years",2017,0.02]
[null,"Czechia","Males","25 to 54 years",2018,1.4999999999999999E-2]
[null,"Czechia","Males","25 to 54 years",2019,1.4999999999999999E-2]
[null,"Czechia","Males","25 to 54 years",2020,2.1000000000000001E-2]
[null,"Czechia","Males","25 to 54 years",2021,2.1000000000000001E-2]
[null,"Czechia","Males","25 to 54 years",2022,1.4999999999999999E-2]
[null,"Czechia","Males","25 to 54 years",2023,1.9E-2]
[null,"Czechia","Males","25 to 54 years",2024,1.9E-2]
[null,"Denmark","Males","25 to 54 years",2010,7.2999999999999995E-2]
[null,"Denmark","Males","25 to 54 years",2011,6.3E-2]
[null,"Denmark","Males","25 to 54 years",2012,6.7000000000000004E-2]
[null,"Denmark","Males","25 to 54 years",2013,0.06]
[null,"Denmark","Males","25 to 54 years",2014,5.5E-2]
[null,"Denmark","Males","25 to 54 years",2015,5.4000000000000006E-2]
[null,"Denmark","Males","25 to 54 years",2016,4.5999999999999999E-2]
[null,"Denmark","Males","25 to 54 years",2017,4.8000000000000001E-2]
[null,"Denmark","Males","25 to 54 years",2018,4.0999999999999995E-2]
[null,"Denmark","Males","25 to 54 years",2019,4.2000000000000003E-2]
[null,"Denmark","Males","25 to 54 years",2020,4.4000000000000004E-2]
[null,"Denmark","Males","25 to 54 years",2021,4.2000000000000003E-2]
[null,"Denmark","Males","25 to 54 years",2022,3.6000000000000004E-2]
[null,"Denmark","Males","25 to 54 years",2023,4.2000000000000003E-2]
[null,"Denmark","Males","25 to 54 years",2024,4.5999999999999999E-2]
[null,"Estonia","Males","25 to 54 years",2010,0.17399999999999999]
[null,"Estonia","Males","25 to 54 years",2011,0.114]
[null,"Estonia","Males","25 to 54 years",2012,9.8000000000000004E-2]
[null,"Estonia","Males","25 to 54 years",2013,8.3000000000000004E-2]
[null,"Estonia","Males","25 to 54 years",2014,7.0999999999999994E-2]
[null,"Estonia","Males","25 to 54 years",2015,5.5E-2]
[null,"Estonia","Males","25 to 54 years",2016,6.3E-2]
[null,"Estonia","Males","25 to 54 years",2017,5.2999999999999999E-2]
[null,"Estonia","Males","25 to 54 years",2018,4.4000000000000004E-2]
[null,"Estonia","Males","25 to 54 years",2019,3.3000000000000002E-2]
[null,"Estonia","Males","25 to 54 years",2020,5.9000000000000004E-2]
[null,"Estonia","Males","25 to 54 years",2021,5.7999999999999996E-2]
[null,"Estonia","Males","25 to 54 years",2022,5.0999999999999997E-2]
[null,"Estonia","Males","25 to 54 years",2023,5.2000000000000005E-2]
[null,"Estonia","Males","25 to 54 years",2024,6.8000000000000005E-2]
[null,"Finland","Males","25 to 54 years",2010,7.5999999999999998E-2]
[null,"Finland","Males","25 to 54 years",2011,6.9000000000000006E-2]
[null,"Finland","Males","25 to 54 years",2012,6.8000000000000005E-2]
[null,"Finland","Males","25 to 54 years",2013,7.0999999999999994E-2]
[null,"Finland","Males","25 to 54 years",2014,7.8E-2]
[null,"Finland","Males","25 to 54 years",2015,8.199999999999999E-2]
[null,"Finland","Males","25 to 54 years",2016,7.6999999999999999E-2]
[null,"Finland","Males","25 to 54 years",2017,7.4999999999999997E-2]
[null,"Finland","Males","25 to 54 years",2018,6.3E-2]
[null,"Finland","Males","25 to 54 years",2019,5.2999999999999999E-2]
[null,"Finland","Males","25 to 54 years",2020,5.9000000000000004E-2]
[null,"Finland","Males","25 to 54 years",2021,7.0000000000000007E-2]
[null,"Finland","Males","25 to 54 years",2022,5.5999999999999994E-2]
[null,"Finland","Males","25 to 54 years",2023,6.4000000000000001E-2]
[null,"Finland","Males","25 to 54 years",2024,7.6999999999999999E-2]
[null,"France","Males","25 to 54 years",2010,7.6999999999999999E-2]
[null,"France","Males","25 to 54 years",2011,7.6999999999999999E-2]
[null,"France","Males","25 to 54 years",2012,8.5000000000000006E-2]
[null,"France","Males","25 to 54 years",2013,9.1999999999999998E-2]
[null,"France","Males","25 to 54 years",2014,9.3000000000000013E-2]
[null,"France","Males","25 to 54 years",2015,9.5000000000000001E-2]
[null,"France","Males","25 to 54 years",2016,8.900000000000001E-2]
[null,"France","Males","25 to 54 years",2017,8.199999999999999E-2]
[null,"France","Males","25 to 54 years",2018,7.8E-2]
[null,"France","Males","25 to 54 years",2019,7.400000000000001E-2]
[null,"France","Males","25 to 54 years",2020,7.0999999999999994E-2]
[null,"France","Males","25 to 54 years",2021,6.8000000000000005E-2]
[null,"France","Males","25 to 54 years",2022,6.2E-2]
[null,"France","Males","25 to 54 years",2023,6.3E-2]
[null,"France","Males","25 to 54 years",2024,6.3E-2]
[null,"Germany","Males","25 to 54 years",2010,6.4000000000000001E-2]
[null,"Germany","Males","25 to 54 years",2011,5.2000000000000005E-2]
[null,"Germany","Males","25 to 54 years",2012,4.7E-2]
[null,"Germany","Males","25 to 54 years",2013,4.7E-2]
[null,"Germany","Males","25 to 54 years",2014,4.5999999999999999E-2]
[null,"Germany","Males","25 to 54 years",2015,4.2999999999999997E-2]
[null,"Germany","Males","25 to 54 years",2016,3.9E-2]
[null,"Germany","Males","25 to 54 years",2017,3.6000000000000004E-2]
[null,"Germany","Males","25 to 54 years",2018,3.3000000000000002E-2]
[null,"Germany","Males","25 to 54 years",2019,0.03]
[null,"Germany","Males","25 to 54 years",2020,3.7000000000000005E-2]
[null,"Germany","Males","25 to 54 years",2021,3.7999999999999999E-2]
[null,"Germany","Males","25 to 54 years",2022,3.2000000000000001E-2]
[null,"Germany","Males","25 to 54 years",2023,3.1E-2]
[null,"Germany","Males","25 to 54 years",2024,3.6000000000000004E-2]
[null,"Greece","Males","25 to 54 years",2010,9.6000000000000002E-2]
[null,"Greece","Males","25 to 54 years",2011,0.14699999999999999]
[null,"Greece","Males","25 to 54 years",2012,0.21299999999999999]
[null,"Greece","Males","25 to 54 years",2013,0.24]
[null,"Greece","Males","25 to 54 years",2014,0.23]
[null,"Greece","Males","25 to 54 years",2015,0.20899999999999999]
[null,"Greece","Males","25 to 54 years",2016,0.187]
[null,"Greece","Males","25 to 54 years",2017,0.17]
[null,"Greece","Males","25 to 54 years",2018,0.15]
[null,"Greece","Males","25 to 54 years",2019,0.13699999999999998]
[null,"Greece","Males","25 to 54 years",2020,0.14000000000000001]
[null,"Greece","Males","25 to 54 years",2021,0.109]
[null,"Greece","Males","25 to 54 years",2022,8.8000000000000009E-2]
[null,"Greece","Males","25 to 54 years",2023,8.3000000000000004E-2]
[null,"Greece","Males","25 to 54 years",2024,7.9000000000000001E-2]
[null,"Hungary","Males","25 to 54 years",2010,0.107]
[null,"Hungary","Males","25 to 54 years",2011,9.9000000000000005E-2]
[null,"Hungary","Males","25 to 54 years",2012,0.10199999999999999]
[null,"Hungary","Males","25 to 54 years",2013,9.0999999999999998E-2]
[null,"Hungary","Males","25 to 54 years",2014,6.5000000000000002E-2]
[null,"Hungary","Males","25 to 54 years",2015,5.5999999999999994E-2]
[null,"Hungary","Males","25 to 54 years",2016,4.4999999999999998E-2]
[null,"Hungary","Males","25 to 54 years",2017,3.4000000000000002E-2]
[null,"Hungary","Males","25 to 54 years",2018,3.1E-2]
[null,"Hungary","Males","25 to 54 years",2019,2.7999999999999997E-2]
[null,"Hungary","Males","25 to 54 years",2020,3.6000000000000004E-2]
[null,"Hungary","Males","25 to 54 years",2021,3.3000000000000002E-2]
[null,"Hungary","Males","25 to 54 years",2022,3.2000000000000001E-2]
[null,"Hungary","Males","25 to 54 years",2023,3.5000000000000003E-2]
[null,"Hungary","Males","25 to 54 years",2024,3.9E-2]
[null,"Ireland","Males","25 to 54 years",2010,0.154]
[null,"Ireland","Males","25 to 54 years",2011,0.161]
[null,"Ireland","Males","25 to 54 years",2012,0.158]
[null,"Ireland","Males","25 to 54 years",2013,0.13300000000000001]
[null,"Ireland","Males","25 to 54 years",2014,0.113]
[null,"Ireland","Males","25 to 54 years",2015,9.5000000000000001E-2]
[null,"Ireland","Males","25 to 54 years",2016,7.9000000000000001E-2]
[null,"Ireland","Males","25 to 54 years",2017,6.2E-2]
[null,"Ireland","Males","25 to 54 years",2018,4.8000000000000001E-2]
[null,"Ireland","Males","25 to 54 years",2019,4.2999999999999997E-2]
[null,"Ireland","Males","25 to 54 years",2020,4.8000000000000001E-2]
[null,"Ireland","Males","25 to 54 years",2021,5.2999999999999999E-2]
[null,"Ireland","Males","25 to 54 years",2022,3.7000000000000005E-2]
[null,"Ireland","Males","25 to 54 years",2023,3.7000000000000005E-2]
[null,"Ireland","Males","25 to 54 years",2024,3.5000000000000003E-2]
[null,"Italy","Males","25 to 54 years",2010,6.7000000000000004E-2]
[null,"Italy","Males","25 to 54 years",2011,6.7000000000000004E-2]
[null,"Italy","Males","25 to 54 years",2012,8.8000000000000009E-2]
[null,"Italy","Males","25 to 54 years",2013,0.105]
[null,"Italy","Males","25 to 54 years",2014,0.11]
[null,"Italy","Males","25 to 54 years",2015,0.105]
[null,"Italy","Males","25 to 54 years",2016,0.10099999999999999]
[null,"Italy","Males","25 to 54 years",2017,9.8000000000000004E-2]
[null,"Italy","Males","25 to 54 years",2018,9.0999999999999998E-2]
[null,"Italy","Males","25 to 54 years",2019,8.5999999999999993E-2]
[null,"Italy","Males","25 to 54 years",2020,8.1000000000000003E-2]
[null,"Italy","Males","25 to 54 years",2021,8.1000000000000003E-2]
[null,"Italy","Males","25 to 54 years",2022,6.6000000000000003E-2]
[null,"Italy","Males","25 to 54 years",2023,6.4000000000000001E-2]
[null,"Italy","Males","25 to 54 years",2024,5.5999999999999994E-2]
[null,"Latvia","Males","25 to 54 years",2010,0.214]
[null,"Latvia","Males","25 to 54 years",2011,0.17499999999999999]
[null,"Latvia","Males","25 to 54 years",2012,0.14899999999999999]
[null,"Latvia","Males","25 to 54 years",2013,0.11900000000000001]
[null,"Latvia","Males","25 to 54 years",2014,0.11199999999999999]
[null,"Latvia","Males","25 to 54 years",2015,0.10400000000000001]
[null,"Latvia","Males","25 to 54 years",2016,9.9000000000000005E-2]
[null,"Latvia","Males","25 to 54 years",2017,0.09]
[null,"Latvia","Males","25 to 54 years",2018,8.199999999999999E-2]
[null,"Latvia","Males","25 to 54 years",2019,6.7000000000000004E-2]
[null,"Latvia","Males","25 to 54 years",2020,8.900000000000001E-2]
[null,"Latvia","Males","25 to 54 years",2021,8.8000000000000009E-2]
[null,"Latvia","Males","25 to 54 years",2022,7.5999999999999998E-2]
[null,"Latvia","Males","25 to 54 years",2023,7.400000000000001E-2]
[null,"Latvia","Males","25 to 54 years",2024,0.08]
[null,"Lithuania","Males","25 to 54 years",2010,0.2]
[null,"Lithuania","Males","25 to 54 years",2011,0.16500000000000001]
[null,"Lithuania","Males","25 to 54 years",2012,0.14099999999999999]
[null,"Lithuania","Males","25 to 54 years",2013,0.11900000000000001]
[null,"Lithuania","Males","25 to 54 years",2014,0.111]
[null,"Lithuania","Males","25 to 54 years",2015,9.5000000000000001E-2]
[null,"Lithuania","Males","25 to 54 years",2016,8.4000000000000005E-2]
[null,"Lithuania","Males","25 to 54 years",2017,8.1000000000000003E-2]
[null,"Lithuania","Males","25 to 54 years",2018,6.4000000000000001E-2]
[null,"Lithuania","Males","25 to 54 years",2019,6.6000000000000003E-2]
[null,"Lithuania","Males","25 to 54 years",2020,8.1000000000000003E-2]
[null,"Lithuania","Males","25 to 54 years",2021,7.0000000000000007E-2]
[null,"Lithuania","Males","25 to 54 years",2022,5.9000000000000004E-2]
[null,"Lithuania","Males","25 to 54 years",2023,6.2E-2]
[null,"Lithuania","Males","25 to 54 years",2024,6.6000000000000003E-2]
[null,"Luxembourg","Males","25 to 54 years",2010,0.03]
[null,"Luxembourg","Males","25 to 54 years",2011,3.3000000000000002E-2]
[null,"Luxembourg","Males","25 to 54 years",2012,3.7999999999999999E-2]
[null,"Luxembourg","Males","25 to 54 years",2013,4.5999999999999999E-2]
[null,"Luxembourg","Males","25 to 54 years",2014,4.7E-2]
[null,"Luxembourg","Males","25 to 54 years",2015,0.05]
[null,"Luxembourg","Males","25 to 54 years",2016,0.05]
[null,"Luxembourg","Males","25 to 54 years",2017,4.8000000000000001E-2]
[null,"Luxembourg","Males","25 to 54 years",2018,4.4999999999999998E-2]
[null,"Luxembourg","Males","25 to 54 years",2019,4.5999999999999999E-2]
[null,"Luxembourg","Males","25 to 54 years",2020,5.2000000000000005E-2]
[null,"Luxembourg","Males","25 to 54 years",2021,3.7000000000000005E-2]
[null,"Luxembourg","Males","25 to 54 years",2022,3.4000000000000002E-2]
[null,"Luxembourg","Males","25 to 54 years",2023,3.9E-2]
[null,"Luxembourg","Males","25 to 54 years",2024,5.2999999999999999E-2]
[null,"Malta","Males","25 to 54 years",2010,5.7999999999999996E-2]
[null,"Malta","Males","25 to 54 years",2011,5.2000000000000005E-2]
[null,"Malta","Males","25 to 54 years",2012,4.7E-2]
[null,"Malta","Males","25 to 54 years",2013,4.8000000000000001E-2]
[null,"Malta","Males","25 to 54 years",2014,4.8000000000000001E-2]
[null,"Malta","Males","25 to 54 years",2015,4.0999999999999995E-2]
[null,"Malta","Males","25 to 54 years",2016,3.7000000000000005E-2]
[null,"Malta","Males","25 to 54 years",2017,3.1E-2]
[null,"Malta","Males","25 to 54 years",2018,3.3000000000000002E-2]
[null,"Malta","Males","25 to 54 years",2019,3.2000000000000001E-2]
[null,"Malta","Males","25 to 54 years",2020,3.7000000000000005E-2]
[null,"Malta","Males","25 to 54 years",2021,0.03]
[null,"Malta","Males","25 to 54 years",2022,0.03]
[null,"Malta","Males","25 to 54 years",2023,2.8999999999999998E-2]
[null,"Malta","Males","25 to 54 years",2024,2.6000000000000002E-2]
[null,"Netherlands","Males","25 to 54 years",2010,3.6000000000000004E-2]
[null,"Netherlands","Males","25 to 54 years",2011,3.9E-2]
[null,"Netherlands","Males","25 to 54 years",2012,4.7E-2]
[null,"Netherlands","Males","25 to 54 years",2013,6.4000000000000001E-2]
[null,"Netherlands","Males","25 to 54 years",2014,6.3E-2]
[null,"Netherlands","Males","25 to 54 years",2015,5.5E-2]
[null,"Netherlands","Males","25 to 54 years",2016,4.4999999999999998E-2]
[null,"Netherlands","Males","25 to 54 years",2017,3.7999999999999999E-2]
[null,"Netherlands","Males","25 to 54 years",2018,3.2000000000000001E-2]
[null,"Netherlands","Males","25 to 54 years",2019,0.03]
[null,"Netherlands","Males","25 to 54 years",2020,3.3000000000000002E-2]
[null,"Netherlands","Males","25 to 54 years",2021,2.7000000000000003E-2]
[null,"Netherlands","Males","25 to 54 years",2022,2.3E-2]
[null,"Netherlands","Males","25 to 54 years",2023,2.4E-2]
[null,"Netherlands","Males","25 to 54 years",2024,2.4E-2]
[null,"Poland","Males","25 to 54 years",2010,8.199999999999999E-2]
[null,"Poland","Males","25 to 54 years",2011,7.6999999999999999E-2]
[null,"Poland","Males","25 to 54 years",2012,8.199999999999999E-2]
[null,"Poland","Males","25 to 54 years",2013,8.4000000000000005E-2]
[null,"Poland","Males","25 to 54 years",2014,7.400000000000001E-2]
[null,"Poland","Males","25 to 54 years",2015,6.3E-2]
[null,"Poland","Males","25 to 54 years",2016,5.2000000000000005E-2]
[null,"Poland","Males","25 to 54 years",2017,4.0999999999999995E-2]
[null,"Poland","Males","25 to 54 years",2018,3.3000000000000002E-2]
[null,"Poland","Males","25 to 54 years",2019,2.5000000000000001E-2]
[null,"Poland","Males","25 to 54 years",2020,2.6000000000000002E-2]
[null,"Poland","Males","25 to 54 years",2021,2.8999999999999998E-2]
[null,"Poland","Males","25 to 54 years",2022,2.4E-2]
[null,"Poland","Males","25 to 54 years",2023,2.2000000000000002E-2]
[null,"Poland","Males","25 to 54 years",2024,2.1000000000000001E-2]
[null,"Portugal","Males","25 to 54 years",2010,0.11]
[null,"Portugal","Males","25 to 54 years",2011,0.11699999999999999]
[null,"Portugal","Males","25 to 54 years",2012,0.14800000000000002]
[null,"Portugal","Males","25 to 54 years",2013,0.156]
[null,"Portugal","Males","25 to 54 years",2014,0.122]
[null,"Portugal","Males","25 to 54 years",2015,0.109]
[null,"Portugal","Males","25 to 54 years",2016,9.8000000000000004E-2]
[null,"Portugal","Males","25 to 54 years",2017,7.400000000000001E-2]
[null,"Portugal","Males","25 to 54 years",2018,5.5999999999999994E-2]
[null,"Portugal","Males","25 to 54 years",2019,5.0999999999999997E-2]
[null,"Portugal","Males","25 to 54 years",2020,5.7000000000000002E-2]
[null,"Portugal","Males","25 to 54 years",2021,5.2999999999999999E-2]
[null,"Portugal","Males","25 to 54 years",2022,5.0999999999999997E-2]
[null,"Portugal","Males","25 to 54 years",2023,5.0999999999999997E-2]
[null,"Portugal","Males","25 to 54 years",2024,0.05]
[null,"Romania","Males","25 to 54 years",2010,8.1000000000000003E-2]
[null,"Romania","Males","25 to 54 years",2011,7.8E-2]
[null,"Romania","Males","25 to 54 years",2012,7.8E-2]
[null,"Romania","Males","25 to 54 years",2013,8.199999999999999E-2]
[null,"Romania","Males","25 to 54 years",2014,7.8E-2]
[null,"Romania","Males","25 to 54 years",2015,8.1000000000000003E-2]
[null,"Romania","Males","25 to 54 years",2016,7.0000000000000007E-2]
[null,"Romania","Males","25 to 54 years",2017,5.7999999999999996E-2]
[null,"Romania","Males","25 to 54 years",2018,4.9000000000000002E-2]
[null,"Romania","Males","25 to 54 years",2019,4.4000000000000004E-2]
[null,"Romania","Males","25 to 54 years",2020,5.4000000000000006E-2]
[null,"Romania","Males","25 to 54 years",2021,0.05]
[null,"Romania","Males","25 to 54 years",2022,0.05]
[null,"Romania","Males","25 to 54 years",2023,0.05]
[null,"Romania","Males","25 to 54 years",2024,4.8000000000000001E-2]
[null,"Slovakia","Males","25 to 54 years",2010,0.122]
[null,"Slovakia","Males","25 to 54 years",2011,0.115]
[null,"Slovakia","Males","25 to 54 years",2012,0.113]
[null,"Slovakia","Males","25 to 54 years",2013,0.11900000000000001]
[null,"Slovakia","Males","25 to 54 years",2014,0.113]
[null,"Slovakia","Males","25 to 54 years",2015,8.900000000000001E-2]
[null,"Slovakia","Males","25 to 54 years",2016,7.4999999999999997E-2]
[null,"Slovakia","Males","25 to 54 years",2017,7.0999999999999994E-2]
[null,"Slovakia","Males","25 to 54 years",2018,5.5E-2]
[null,"Slovakia","Males","25 to 54 years",2019,5.0999999999999997E-2]
[null,"Slovakia","Males","25 to 54 years",2020,5.7000000000000002E-2]
[null,"Slovakia","Males","25 to 54 years",2021,6.0999999999999999E-2]
[null,"Slovakia","Males","25 to 54 years",2022,5.2999999999999999E-2]
[null,"Slovakia","Males","25 to 54 years",2023,5.0999999999999997E-2]
[null,"Slovakia","Males","25 to 54 years",2024,4.2000000000000003E-2]
[null,"Slovenia","Males","25 to 54 years",2010,7.0999999999999994E-2]
[null,"Slovenia","Males","25 to 54 years",2011,7.6999999999999999E-2]
[null,"Slovenia","Males","25 to 54 years",2012,7.5999999999999998E-2]
[null,"Slovenia","Males","25 to 54 years",2013,8.900000000000001E-2]
[null,"Slovenia","Males","25 to 54 years",2014,8.3000000000000004E-2]
[null,"Slovenia","Males","25 to 54 years",2015,7.2999999999999995E-2]
[null,"Slovenia","Males","25 to 54 years",2016,6.9000000000000006E-2]
[null,"Slovenia","Males","25 to 54 years",2017,5.2000000000000005E-2]
[null,"Slovenia","Males","25 to 54 years",2018,4.2000000000000003E-2]
[null,"Slovenia","Males","25 to 54 years",2019,3.7000000000000005E-2]
[null,"Slovenia","Males","25 to 54 years",2020,0.04]
[null,"Slovenia","Males","25 to 54 years",2021,3.7000000000000005E-2]
[null,"Slovenia","Males","25 to 54 years",2022,3.2000000000000001E-2]
[null,"Slovenia","Males","25 to 54 years",2023,2.7999999999999997E-2]
[null,"Slovenia","Males","25 to 54 years",2024,2.5000000000000001E-2]
[null,"Spain","Males","25 to 54 years",2010,0.17899999999999999]
[null,"Spain","Males","25 to 54 years",2011,0.19399999999999998]
[null,"Spain","Males","25 to 54 years",2012,0.23]
[null,"Spain","Males","25 to 54 years",2013,0.23800000000000002]
[null,"Spain","Males","25 to 54 years",2014,0.217]
[null,"Spain","Males","25 to 54 years",2015,0.18899999999999997]
[null,"Spain","Males","25 to 54 years",2016,0.16300000000000001]
[null,"Spain","Males","25 to 54 years",2017,0.13900000000000001]
[null,"Spain","Males","25 to 54 years",2018,0.121]
[null,"Spain","Males","25 to 54 years",2019,0.11]
[null,"Spain","Males","25 to 54 years",2020,0.126]
[null,"Spain","Males","25 to 54 years",2021,0.11900000000000001]
[null,"Spain","Males","25 to 54 years",2022,0.10099999999999999]
[null,"Spain","Males","25 to 54 years",2023,9.1999999999999998E-2]
[null,"Spain","Males","25 to 54 years",2024,8.900000000000001E-2]
[null,"Sweden","Males","25 to 54 years",2010,6.5000000000000002E-2]
[null,"Sweden","Males","25 to 54 years",2011,5.9000000000000004E-2]
[null,"Sweden","Males","25 to 54 years",2012,6.3E-2]
[null,"Sweden","Males","25 to 54 years",2013,6.3E-2]
[null,"Sweden","Males","25 to 54 years",2014,6.2E-2]
[null,"Sweden","Males","25 to 54 years",2015,0.06]
[null,"Sweden","Males","25 to 54 years",2016,5.7999999999999996E-2]
[null,"Sweden","Males","25 to 54 years",2017,5.7000000000000002E-2]
[null,"Sweden","Males","25 to 54 years",2018,5.2999999999999999E-2]
[null,"Sweden","Males","25 to 54 years",2019,5.2000000000000005E-2]
[null,"Sweden","Males","25 to 54 years",2020,6.8000000000000005E-2]
[null,"Sweden","Males","25 to 54 years",2021,6.5000000000000002E-2]
[null,"Sweden","Males","25 to 54 years",2022,5.2999999999999999E-2]
[null,"Sweden","Males","25 to 54 years",2023,5.5999999999999994E-2]
[null,"Sweden","Males","25 to 54 years",2024,6.0999999999999999E-2]
[null,"Austria","Males","25 to 74 years",2010,4.7E-2]
[null,"Austria","Males","25 to 74 years",2011,4.2999999999999997E-2]
[null,"Austria","Males","25 to 74 years",2012,4.5999999999999999E-2]
[null,"Austria","Males","25 to 74 years",2013,5.2000000000000005E-2]
[null,"Austria","Males","25 to 74 years",2014,5.5999999999999994E-2]
[null,"Austria","Males","25 to 74 years",2015,5.9000000000000004E-2]
[null,"Austria","Males","25 to 74 years",2016,6.0999999999999999E-2]
[null,"Austria","Males","25 to 74 years",2017,5.7999999999999996E-2]
[null,"Austria","Males","25 to 74 years",2018,4.9000000000000002E-2]
[null,"Austria","Males","25 to 74 years",2019,4.4000000000000004E-2]
[null,"Austria","Males","25 to 74 years",2020,5.2999999999999999E-2]
[null,"Austria","Males","25 to 74 years",2021,5.7000000000000002E-2]
[null,"Austria","Males","25 to 74 years",2022,4.4000000000000004E-2]
[null,"Austria","Males","25 to 74 years",2023,4.7E-2]
[null,"Austria","Males","25 to 74 years",2024,0.05]
[null,"Belgium","Males","25 to 74 years",2010,6.8000000000000005E-2]
[null,"Belgium","Males","25 to 74 years",2011,6.0999999999999999E-2]
[null,"Belgium","Males","25 to 74 years",2012,6.5000000000000002E-2]
[null,"Belgium","Males","25 to 74 years",2013,7.2999999999999995E-2]
[null,"Belgium","Males","25 to 74 years",2014,7.8E-2]
[null,"Belgium","Males","25 to 74 years",2015,0.08]
[null,"Belgium","Males","25 to 74 years",2016,7.0999999999999994E-2]
[null,"Belgium","Males","25 to 74 years",2017,6.0999999999999999E-2]
[null,"Belgium","Males","25 to 74 years",2018,5.5999999999999994E-2]
[null,"Belgium","Males","25 to 74 years",2019,0.05]
[null,"Belgium","Males","25 to 74 years",2020,5.2000000000000005E-2]
[null,"Belgium","Males","25 to 74 years",2021,5.5E-2]
[null,"Belgium","Males","25 to 74 years",2022,4.8000000000000001E-2]
[null,"Belgium","Males","25 to 74 years",2023,4.9000000000000002E-2]
[null,"Belgium","Males","25 to 74 years",2024,4.9000000000000002E-2]
[null,"Bulgaria","Males","25 to 74 years",2010,0.106]
[null,"Bulgaria","Males","25 to 74 years",2011,0.12]
[null,"Bulgaria","Males","25 to 74 years",2012,0.13]
[null,"Bulgaria","Males","25 to 74 years",2013,0.13500000000000001]
[null,"Bulgaria","Males","25 to 74 years",2014,0.124]
[null,"Bulgaria","Males","25 to 74 years",2015,9.9000000000000005E-2]
[null,"Bulgaria","Males","25 to 74 years",2016,8.5000000000000006E-2]
[null,"Bulgaria","Males","25 to 74 years",2017,6.9000000000000006E-2]
[null,"Bulgaria","Males","25 to 74 years",2018,6.2E-2]
[null,"Bulgaria","Males","25 to 74 years",2019,5.2000000000000005E-2]
[null,"Bulgaria","Males","25 to 74 years",2020,5.9000000000000004E-2]
[null,"Bulgaria","Males","25 to 74 years",2021,4.9000000000000002E-2]
[null,"Bulgaria","Males","25 to 74 years",2022,0.04]
[null,"Bulgaria","Males","25 to 74 years",2023,0.04]
[null,"Bulgaria","Males","25 to 74 years",2024,0.04]
[null,"Croatia","Males","25 to 74 years",2010,8.6999999999999994E-2]
[null,"Croatia","Males","25 to 74 years",2011,0.113]
[null,"Croatia","Males","25 to 74 years",2012,0.13699999999999998]
[null,"Croatia","Males","25 to 74 years",2013,0.14599999999999999]
[null,"Croatia","Males","25 to 74 years",2014,0.13400000000000001]
[null,"Croatia","Males","25 to 74 years",2015,0.129]
[null,"Croatia","Males","25 to 74 years",2016,0.10400000000000001]
[null,"Croatia","Males","25 to 74 years",2017,8.6999999999999994E-2]
[null,"Croatia","Males","25 to 74 years",2018,6.3E-2]
[null,"Croatia","Males","25 to 74 years",2019,5.2000000000000005E-2]
[null,"Croatia","Males","25 to 74 years",2020,6.2E-2]
[null,"Croatia","Males","25 to 74 years",2021,0.06]
[null,"Croatia","Males","25 to 74 years",2022,5.0999999999999997E-2]
[null,"Croatia","Males","25 to 74 years",2023,4.5999999999999999E-2]
[null,"Croatia","Males","25 to 74 years",2024,4.0999999999999995E-2]
[null,"Cyprus","Males","25 to 74 years",2010,5.2000000000000005E-2]
[null,"Cyprus","Males","25 to 74 years",2011,6.6000000000000003E-2]
[null,"Cyprus","Males","25 to 74 years",2012,0.109]
[null,"Cyprus","Males","25 to 74 years",2013,0.14199999999999999]
[null,"Cyprus","Males","25 to 74 years",2014,0.151]
[null,"Cyprus","Males","25 to 74 years",2015,0.13400000000000001]
[null,"Cyprus","Males","25 to 74 years",2016,0.11599999999999999]
[null,"Cyprus","Males","25 to 74 years",2017,9.6999999999999989E-2]
[null,"Cyprus","Males","25 to 74 years",2018,6.7000000000000004E-2]
[null,"Cyprus","Males","25 to 74 years",2019,5.7999999999999996E-2]
[null,"Cyprus","Males","25 to 74 years",2020,6.7000000000000004E-2]
[null,"Cyprus","Males","25 to 74 years",2021,6.2E-2]
[null,"Cyprus","Males","25 to 74 years",2022,4.9000000000000002E-2]
[null,"Cyprus","Males","25 to 74 years",2023,4.9000000000000002E-2]
[null,"Cyprus","Males","25 to 74 years",2024,4.0999999999999995E-2]
[null,"Czechia","Males","25 to 74 years",2010,5.4000000000000006E-2]
[null,"Czechia","Males","25 to 74 years",2011,4.8000000000000001E-2]
[null,"Czechia","Males","25 to 74 years",2012,4.9000000000000002E-2]
[null,"Czechia","Males","25 to 74 years",2013,4.9000000000000002E-2]
[null,"Czechia","Males","25 to 74 years",2014,4.2999999999999997E-2]
[null,"Czechia","Males","25 to 74 years",2015,3.7000000000000005E-2]
[null,"Czechia","Males","25 to 74 years",2016,2.8999999999999998E-2]
[null,"Czechia","Males","25 to 74 years",2017,0.02]
[null,"Czechia","Males","25 to 74 years",2018,1.4999999999999999E-2]
[null,"Czechia","Males","25 to 74 years",2019,1.4999999999999999E-2]
[null,"Czechia","Males","25 to 74 years",2020,1.9E-2]
[null,"Czechia","Males","25 to 74 years",2021,0.02]
[null,"Czechia","Males","25 to 74 years",2022,1.6E-2]
[null,"Czechia","Males","25 to 74 years",2023,1.9E-2]
[null,"Czechia","Males","25 to 74 years",2024,1.9E-2]
[null,"Denmark","Males","25 to 74 years",2010,7.0999999999999994E-2]
[null,"Denmark","Males","25 to 74 years",2011,6.0999999999999999E-2]
[null,"Denmark","Males","25 to 74 years",2012,6.3E-2]
[null,"Denmark","Males","25 to 74 years",2013,5.5999999999999994E-2]
[null,"Denmark","Males","25 to 74 years",2014,5.2999999999999999E-2]
[null,"Denmark","Males","25 to 74 years",2015,4.9000000000000002E-2]
[null,"Denmark","Males","25 to 74 years",2016,4.4000000000000004E-2]
[null,"Denmark","Males","25 to 74 years",2017,4.4000000000000004E-2]
[null,"Denmark","Males","25 to 74 years",2018,3.7999999999999999E-2]
[null,"Denmark","Males","25 to 74 years",2019,3.9E-2]
[null,"Denmark","Males","25 to 74 years",2020,4.2000000000000003E-2]
[null,"Denmark","Males","25 to 74 years",2021,4.2000000000000003E-2]
[null,"Denmark","Males","25 to 74 years",2022,3.4000000000000002E-2]
[null,"Denmark","Males","25 to 74 years",2023,3.9E-2]
[null,"Denmark","Males","25 to 74 years",2024,4.4000000000000004E-2]
[null,"Estonia","Males","25 to 74 years",2010,0.17300000000000001]
[null,"Estonia","Males","25 to 74 years",2011,0.11699999999999999]
[null,"Estonia","Males","25 to 74 years",2012,9.5000000000000001E-2]
[null,"Estonia","Males","25 to 74 years",2013,8.199999999999999E-2]
[null,"Estonia","Males","25 to 74 years",2014,6.8000000000000005E-2]
[null,"Estonia","Males","25 to 74 years",2015,5.5999999999999994E-2]
[null,"Estonia","Males","25 to 74 years",2016,6.7000000000000004E-2]
[null,"Estonia","Males","25 to 74 years",2017,5.5999999999999994E-2]
[null,"Estonia","Males","25 to 74 years",2018,4.9000000000000002E-2]
[null,"Estonia","Males","25 to 74 years",2019,3.5000000000000003E-2]
[null,"Estonia","Males","25 to 74 years",2020,6.2E-2]
[null,"Estonia","Males","25 to 74 years",2021,0.06]
[null,"Estonia","Males","25 to 74 years",2022,0.05]
[null,"Estonia","Males","25 to 74 years",2023,5.2000000000000005E-2]
[null,"Estonia","Males","25 to 74 years",2024,6.6000000000000003E-2]
[null,"Finland","Males","25 to 74 years",2010,7.400000000000001E-2]
[null,"Finland","Males","25 to 74 years",2011,7.0000000000000007E-2]
[null,"Finland","Males","25 to 74 years",2012,6.9000000000000006E-2]
[null,"Finland","Males","25 to 74 years",2013,7.0999999999999994E-2]
[null,"Finland","Males","25 to 74 years",2014,7.6999999999999999E-2]
[null,"Finland","Males","25 to 74 years",2015,8.199999999999999E-2]
[null,"Finland","Males","25 to 74 years",2016,7.6999999999999999E-2]
[null,"Finland","Males","25 to 74 years",2017,7.5999999999999998E-2]
[null,"Finland","Males","25 to 74 years",2018,6.5000000000000002E-2]
[null,"Finland","Males","25 to 74 years",2019,5.7000000000000002E-2]
[null,"Finland","Males","25 to 74 years",2020,6.2E-2]
[null,"Finland","Males","25 to 74 years",2021,7.0000000000000007E-2]
[null,"Finland","Males","25 to 74 years",2022,6.2E-2]
[null,"Finland","Males","25 to 74 years",2023,6.8000000000000005E-2]
[null,"Finland","Males","25 to 74 years",2024,7.9000000000000001E-2]
[null,"France","Males","25 to 74 years",2010,7.4999999999999997E-2]
[null,"France","Males","25 to 74 years",2011,7.4999999999999997E-2]
[null,"France","Males","25 to 74 years",2012,8.199999999999999E-2]
[null,"France","Males","25 to 74 years",2013,8.900000000000001E-2]
[null,"France","Males","25 to 74 years",2014,0.09]
[null,"France","Males","25 to 74 years",2015,9.1999999999999998E-2]
[null,"France","Males","25 to 74 years",2016,8.6999999999999994E-2]
[null,"France","Males","25 to 74 years",2017,0.08]
[null,"France","Males","25 to 74 years",2018,7.5999999999999998E-2]
[null,"France","Males","25 to 74 years",2019,7.2000000000000008E-2]
[null,"France","Males","25 to 74 years",2020,6.8000000000000005E-2]
[null,"France","Males","25 to 74 years",2021,6.7000000000000004E-2]
[null,"France","Males","25 to 74 years",2022,6.0999999999999999E-2]
[null,"France","Males","25 to 74 years",2023,6.0999999999999999E-2]
[null,"France","Males","25 to 74 years",2024,6.0999999999999999E-2]
[null,"Germany","Males","25 to 74 years",2010,6.4000000000000001E-2]
[null,"Germany","Males","25 to 74 years",2011,5.2000000000000005E-2]
[null,"Germany","Males","25 to 74 years",2012,4.8000000000000001E-2]
[null,"Germany","Males","25 to 74 years",2013,4.8000000000000001E-2]
[null,"Germany","Males","25 to 74 years",2014,4.5999999999999999E-2]
[null,"Germany","Males","25 to 74 years",2015,4.2999999999999997E-2]
[null,"Germany","Males","25 to 74 years",2016,3.7999999999999999E-2]
[null,"Germany","Males","25 to 74 years",2017,3.4000000000000002E-2]
[null,"Germany","Males","25 to 74 years",2018,3.1E-2]
[null,"Germany","Males","25 to 74 years",2019,2.8999999999999998E-2]
[null,"Germany","Males","25 to 74 years",2020,3.5000000000000003E-2]
[null,"Germany","Males","25 to 74 years",2021,3.6000000000000004E-2]
[null,"Germany","Males","25 to 74 years",2022,0.03]
[null,"Germany","Males","25 to 74 years",2023,2.8999999999999998E-2]
[null,"Germany","Males","25 to 74 years",2024,3.2000000000000001E-2]
[null,"Greece","Males","25 to 74 years",2010,8.900000000000001E-2]
[null,"Greece","Males","25 to 74 years",2011,0.13600000000000001]
[null,"Greece","Males","25 to 74 years",2012,0.2]
[null,"Greece","Males","25 to 74 years",2013,0.22699999999999998]
[null,"Greece","Males","25 to 74 years",2014,0.221]
[null,"Greece","Males","25 to 74 years",2015,0.20300000000000001]
[null,"Greece","Males","25 to 74 years",2016,0.188]
[null,"Greece","Males","25 to 74 years",2017,0.16899999999999998]
[null,"Greece","Males","25 to 74 years",2018,0.14599999999999999]
[null,"Greece","Males","25 to 74 years",2019,0.13300000000000001]
[null,"Greece","Males","25 to 74 years",2020,0.13600000000000001]
[null,"Greece","Males","25 to 74 years",2021,0.10400000000000001]
[null,"Greece","Males","25 to 74 years",2022,8.5000000000000006E-2]
[null,"Greece","Males","25 to 74 years",2023,7.5999999999999998E-2]
[null,"Greece","Males","25 to 74 years",2024,7.2999999999999995E-2]
[null,"Hungary","Males","25 to 74 years",2010,0.10300000000000001]
[null,"Hungary","Males","25 to 74 years",2011,9.8000000000000004E-2]
[null,"Hungary","Males","25 to 74 years",2012,0.1]
[null,"Hungary","Males","25 to 74 years",2013,8.900000000000001E-2]
[null,"Hungary","Males","25 to 74 years",2014,6.5000000000000002E-2]
[null,"Hungary","Males","25 to 74 years",2015,5.5999999999999994E-2]
[null,"Hungary","Males","25 to 74 years",2016,4.4000000000000004E-2]
[null,"Hungary","Males","25 to 74 years",2017,3.3000000000000002E-2]
[null,"Hungary","Males","25 to 74 years",2018,2.8999999999999998E-2]
[null,"Hungary","Males","25 to 74 years",2019,2.7000000000000003E-2]
[null,"Hungary","Males","25 to 74 years",2020,3.5000000000000003E-2]
[null,"Hungary","Males","25 to 74 years",2021,3.3000000000000002E-2]
[null,"Hungary","Males","25 to 74 years",2022,3.2000000000000001E-2]
[null,"Hungary","Males","25 to 74 years",2023,3.4000000000000002E-2]
[null,"Hungary","Males","25 to 74 years",2024,3.7999999999999999E-2]
[null,"Ireland","Males","25 to 74 years",2010,0.14300000000000002]
[null,"Ireland","Males","25 to 74 years",2011,0.151]
[null,"Ireland","Males","25 to 74 years",2012,0.15]
[null,"Ireland","Males","25 to 74 years",2013,0.128]
[null,"Ireland","Males","25 to 74 years",2014,0.109]
[null,"Ireland","Males","25 to 74 years",2015,9.0999999999999998E-2]
[null,"Ireland","Males","25 to 74 years",2016,7.5999999999999998E-2]
[null,"Ireland","Males","25 to 74 years",2017,0.06]
[null,"Ireland","Males","25 to 74 years",2018,4.7E-2]
[null,"Ireland","Males","25 to 74 years",2019,0.04]
[null,"Ireland","Males","25 to 74 years",2020,4.5999999999999999E-2]
[null,"Ireland","Males","25 to 74 years",2021,5.2000000000000005E-2]
[null,"Ireland","Males","25 to 74 years",2022,3.6000000000000004E-2]
[null,"Ireland","Males","25 to 74 years",2023,3.5000000000000003E-2]
[null,"Ireland","Males","25 to 74 years",2024,3.3000000000000002E-2]
[null,"Italy","Males","25 to 74 years",2010,6.3E-2]
[null,"Italy","Males","25 to 74 years",2011,6.3E-2]
[null,"Italy","Males","25 to 74 years",2012,8.3000000000000004E-2]
[null,"Italy","Males","25 to 74 years",2013,9.8000000000000004E-2]
[null,"Italy","Males","25 to 74 years",2014,0.1]
[null,"Italy","Males","25 to 74 years",2015,9.6000000000000002E-2]
[null,"Italy","Males","25 to 74 years",2016,9.3000000000000013E-2]
[null,"Italy","Males","25 to 74 years",2017,8.900000000000001E-2]
[null,"Italy","Males","25 to 74 years",2018,8.4000000000000005E-2]
[null,"Italy","Males","25 to 74 years",2019,7.9000000000000001E-2]
[null,"Italy","Males","25 to 74 years",2020,7.2999999999999995E-2]
[null,"Italy","Males","25 to 74 years",2021,7.4999999999999997E-2]
[null,"Italy","Males","25 to 74 years",2022,6.0999999999999999E-2]
[null,"Italy","Males","25 to 74 years",2023,5.7999999999999996E-2]
[null,"Italy","Males","25 to 74 years",2024,0.05]
[null,"Latvia","Males","25 to 74 years",2010,0.21]
[null,"Latvia","Males","25 to 74 years",2011,0.17199999999999999]
[null,"Latvia","Males","25 to 74 years",2012,0.14800000000000002]
[null,"Latvia","Males","25 to 74 years",2013,0.11599999999999999]
[null,"Latvia","Males","25 to 74 years",2014,0.111]
[null,"Latvia","Males","25 to 74 years",2015,0.10400000000000001]
[null,"Latvia","Males","25 to 74 years",2016,0.1]
[null,"Latvia","Males","25 to 74 years",2017,9.0999999999999998E-2]
[null,"Latvia","Males","25 to 74 years",2018,8.1000000000000003E-2]
[null,"Latvia","Males","25 to 74 years",2019,6.7000000000000004E-2]
[null,"Latvia","Males","25 to 74 years",2020,8.8000000000000009E-2]
[null,"Latvia","Males","25 to 74 years",2021,8.1000000000000003E-2]
[null,"Latvia","Males","25 to 74 years",2022,7.2000000000000008E-2]
[null,"Latvia","Males","25 to 74 years",2023,7.0999999999999994E-2]
[null,"Latvia","Males","25 to 74 years",2024,7.5999999999999998E-2]
[null,"Lithuania","Males","25 to 74 years",2010,0.193]
[null,"Lithuania","Males","25 to 74 years",2011,0.16200000000000001]
[null,"Lithuania","Males","25 to 74 years",2012,0.13699999999999998]
[null,"Lithuania","Males","25 to 74 years",2013,0.12]
[null,"Lithuania","Males","25 to 74 years",2014,0.114]
[null,"Lithuania","Males","25 to 74 years",2015,9.5000000000000001E-2]
[null,"Lithuania","Males","25 to 74 years",2016,8.4000000000000005E-2]
[null,"Lithuania","Males","25 to 74 years",2017,0.08]
[null,"Lithuania","Males","25 to 74 years",2018,6.5000000000000002E-2]
[null,"Lithuania","Males","25 to 74 years",2019,6.4000000000000001E-2]
[null,"Lithuania","Males","25 to 74 years",2020,8.3000000000000004E-2]
[null,"Lithuania","Males","25 to 74 years",2021,7.0999999999999994E-2]
[null,"Lithuania","Males","25 to 74 years",2022,0.06]
[null,"Lithuania","Males","25 to 74 years",2023,6.6000000000000003E-2]
[null,"Lithuania","Males","25 to 74 years",2024,7.2000000000000008E-2]
[null,"Luxembourg","Males","25 to 74 years",2010,2.8999999999999998E-2]
[null,"Luxembourg","Males","25 to 74 years",2011,3.2000000000000001E-2]
[null,"Luxembourg","Males","25 to 74 years",2012,3.6000000000000004E-2]
[null,"Luxembourg","Males","25 to 74 years",2013,4.4999999999999998E-2]
[null,"Luxembourg","Males","25 to 74 years",2014,4.5999999999999999E-2]
[null,"Luxembourg","Males","25 to 74 years",2015,0.05]
[null,"Luxembourg","Males","25 to 74 years",2016,0.05]
[null,"Luxembourg","Males","25 to 74 years",2017,4.5999999999999999E-2]
[null,"Luxembourg","Males","25 to 74 years",2018,4.4000000000000004E-2]
[null,"Luxembourg","Males","25 to 74 years",2019,4.5999999999999999E-2]
[null,"Luxembourg","Males","25 to 74 years",2020,5.2000000000000005E-2]
[null,"Luxembourg","Males","25 to 74 years",2021,3.9E-2]
[null,"Luxembourg","Males","25 to 74 years",2022,3.6000000000000004E-2]
[null,"Luxembourg","Males","25 to 74 years",2023,4.0999999999999995E-2]
[null,"Luxembourg","Males","25 to 74 years",2024,0.05]
[null,"Malta","Males","25 to 74 years",2010,5.5E-2]
[null,"Malta","Males","25 to 74 years",2011,4.7E-2]
[null,"Malta","Males","25 to 74 years",2012,4.4000000000000004E-2]
[null,"Malta","Males","25 to 74 years",2013,4.8000000000000001E-2]
[null,"Malta","Males","25 to 74 years",2014,5.0999999999999997E-2]
[null,"Malta","Males","25 to 74 years",2015,4.2999999999999997E-2]
[null,"Malta","Males","25 to 74 years",2016,3.6000000000000004E-2]
[null,"Malta","Males","25 to 74 years",2017,2.8999999999999998E-2]
[null,"Malta","Males","25 to 74 years",2018,3.2000000000000001E-2]
[null,"Malta","Males","25 to 74 years",2019,2.7999999999999997E-2]
[null,"Malta","Males","25 to 74 years",2020,3.6000000000000004E-2]
[null,"Malta","Males","25 to 74 years",2021,0.03]
[null,"Malta","Males","25 to 74 years",2022,2.8999999999999998E-2]
[null,"Malta","Males","25 to 74 years",2023,2.8999999999999998E-2]
[null,"Malta","Males","25 to 74 years",2024,2.6000000000000002E-2]
[null,"Netherlands","Males","25 to 74 years",2010,3.7999999999999999E-2]
[null,"Netherlands","Males","25 to 74 years",2011,4.2000000000000003E-2]
[null,"Netherlands","Males","25 to 74 years",2012,0.05]
[null,"Netherlands","Males","25 to 74 years",2013,6.7000000000000004E-2]
[null,"Netherlands","Males","25 to 74 years",2014,6.8000000000000005E-2]
[null,"Netherlands","Males","25 to 74 years",2015,6.3E-2]
[null,"Netherlands","Males","25 to 74 years",2016,5.2000000000000005E-2]
[null,"Netherlands","Males","25 to 74 years",2017,4.2999999999999997E-2]
[null,"Netherlands","Males","25 to 74 years",2018,3.6000000000000004E-2]
[null,"Netherlands","Males","25 to 74 years",2019,3.3000000000000002E-2]
[null,"Netherlands","Males","25 to 74 years",2020,3.3000000000000002E-2]
[null,"Netherlands","Males","25 to 74 years",2021,2.8999999999999998E-2]
[null,"Netherlands","Males","25 to 74 years",2022,2.5000000000000001E-2]
[null,"Netherlands","Males","25 to 74 years",2023,2.3E-2]
[null,"Netherlands","Males","25 to 74 years",2024,2.4E-2]
[null,"Poland","Males","25 to 74 years",2010,8.1000000000000003E-2]
[null,"Poland","Males","25 to 74 years",2011,7.6999999999999999E-2]
[null,"Poland","Males","25 to 74 years",2012,8.1000000000000003E-2]
[null,"Poland","Males","25 to 74 years",2013,8.4000000000000005E-2]
[null,"Poland","Males","25 to 74 years",2014,7.2999999999999995E-2]
[null,"Poland","Males","25 to 74 years",2015,6.2E-2]
[null,"Poland","Males","25 to 74 years",2016,5.2000000000000005E-2]
[null,"Poland","Males","25 to 74 years",2017,4.0999999999999995E-2]
[null,"Poland","Males","25 to 74 years",2018,3.3000000000000002E-2]
[null,"Poland","Males","25 to 74 years",2019,2.5000000000000001E-2]
[null,"Poland","Males","25 to 74 years",2020,2.6000000000000002E-2]
[null,"Poland","Males","25 to 74 years",2021,2.7999999999999997E-2]
[null,"Poland","Males","25 to 74 years",2022,2.3E-2]
[null,"Poland","Males","25 to 74 years",2023,2.2000000000000002E-2]
[null,"Poland","Males","25 to 74 years",2024,2.1000000000000001E-2]
[null,"Portugal","Males","25 to 74 years",2010,0.109]
[null,"Portugal","Males","25 to 74 years",2011,0.11699999999999999]
[null,"Portugal","Males","25 to 74 years",2012,0.14800000000000002]
[null,"Portugal","Males","25 to 74 years",2013,0.154]
[null,"Portugal","Males","25 to 74 years",2014,0.127]
[null,"Portugal","Males","25 to 74 years",2015,0.114]
[null,"Portugal","Males","25 to 74 years",2016,0.10199999999999999]
[null,"Portugal","Males","25 to 74 years",2017,7.6999999999999999E-2]
[null,"Portugal","Males","25 to 74 years",2018,5.7000000000000002E-2]
[null,"Portugal","Males","25 to 74 years",2019,5.2000000000000005E-2]
[null,"Portugal","Males","25 to 74 years",2020,5.7999999999999996E-2]
[null,"Portugal","Males","25 to 74 years",2021,5.4000000000000006E-2]
[null,"Portugal","Males","25 to 74 years",2022,4.8000000000000001E-2]
[null,"Portugal","Males","25 to 74 years",2023,0.05]
[null,"Portugal","Males","25 to 74 years",2024,4.9000000000000002E-2]
[null,"Romania","Males","25 to 74 years",2010,7.8E-2]
[null,"Romania","Males","25 to 74 years",2011,7.6999999999999999E-2]
[null,"Romania","Males","25 to 74 years",2012,7.4999999999999997E-2]
[null,"Romania","Males","25 to 74 years",2013,7.9000000000000001E-2]
[null,"Romania","Males","25 to 74 years",2014,7.400000000000001E-2]
[null,"Romania","Males","25 to 74 years",2015,7.6999999999999999E-2]
[null,"Romania","Males","25 to 74 years",2016,6.6000000000000003E-2]
[null,"Romania","Males","25 to 74 years",2017,5.5999999999999994E-2]
[null,"Romania","Males","25 to 74 years",2018,4.7E-2]
[null,"Romania","Males","25 to 74 years",2019,4.2000000000000003E-2]
[null,"Romania","Males","25 to 74 years",2020,5.2000000000000005E-2]
[null,"Romania","Males","25 to 74 years",2021,4.8000000000000001E-2]
[null,"Romania","Males","25 to 74 years",2022,4.9000000000000002E-2]
[null,"Romania","Males","25 to 74 years",2023,4.8000000000000001E-2]
[null,"Romania","Males","25 to 74 years",2024,4.4000000000000004E-2]
[null,"Slovakia","Males","25 to 74 years",2010,0.11599999999999999]
[null,"Slovakia","Males","25 to 74 years",2011,0.11199999999999999]
[null,"Slovakia","Males","25 to 74 years",2012,0.11]
[null,"Slovakia","Males","25 to 74 years",2013,0.115]
[null,"Slovakia","Males","25 to 74 years",2014,0.109]
[null,"Slovakia","Males","25 to 74 years",2015,8.5999999999999993E-2]
[null,"Slovakia","Males","25 to 74 years",2016,7.4999999999999997E-2]
[null,"Slovakia","Males","25 to 74 years",2017,6.8000000000000005E-2]
[null,"Slovakia","Males","25 to 74 years",2018,5.2999999999999999E-2]
[null,"Slovakia","Males","25 to 74 years",2019,4.8000000000000001E-2]
[null,"Slovakia","Males","25 to 74 years",2020,5.2999999999999999E-2]
[null,"Slovakia","Males","25 to 74 years",2021,5.7999999999999996E-2]
[null,"Slovakia","Males","25 to 74 years",2022,5.0999999999999997E-2]
[null,"Slovakia","Males","25 to 74 years",2023,4.7E-2]
[null,"Slovakia","Males","25 to 74 years",2024,3.9E-2]
[null,"Slovenia","Males","25 to 74 years",2010,6.6000000000000003E-2]
[null,"Slovenia","Males","25 to 74 years",2011,7.4999999999999997E-2]
[null,"Slovenia","Males","25 to 74 years",2012,7.2999999999999995E-2]
[null,"Slovenia","Males","25 to 74 years",2013,8.5999999999999993E-2]
[null,"Slovenia","Males","25 to 74 years",2014,8.1000000000000003E-2]
[null,"Slovenia","Males","25 to 74 years",2015,7.2999999999999995E-2]
[null,"Slovenia","Males","25 to 74 years",2016,6.9000000000000006E-2]
[null,"Slovenia","Males","25 to 74 years",2017,5.4000000000000006E-2]
[null,"Slovenia","Males","25 to 74 years",2018,4.2999999999999997E-2]
[null,"Slovenia","Males","25 to 74 years",2019,3.7999999999999999E-2]
[null,"Slovenia","Males","25 to 74 years",2020,3.7999999999999999E-2]
[null,"Slovenia","Males","25 to 74 years",2021,3.7000000000000005E-2]
[null,"Slovenia","Males","25 to 74 years",2022,3.4000000000000002E-2]
[null,"Slovenia","Males","25 to 74 years",2023,0.03]
[null,"Slovenia","Males","25 to 74 years",2024,2.7999999999999997E-2]
[null,"Spain","Males","25 to 74 years",2010,0.17399999999999999]
[null,"Spain","Males","25 to 74 years",2011,0.187]
[null,"Spain","Males","25 to 74 years",2012,0.222]
[null,"Spain","Males","25 to 74 years",2013,0.23199999999999998]
[null,"Spain","Males","25 to 74 years",2014,0.214]
[null,"Spain","Males","25 to 74 years",2015,0.188]
[null,"Spain","Males","25 to 74 years",2016,0.16300000000000001]
[null,"Spain","Males","25 to 74 years",2017,0.14000000000000001]
[null,"Spain","Males","25 to 74 years",2018,0.122]
[null,"Spain","Males","25 to 74 years",2019,0.111]
[null,"Spain","Males","25 to 74 years",2020,0.12300000000000001]
[null,"Spain","Males","25 to 74 years",2021,0.11800000000000001]
[null,"Spain","Males","25 to 74 years",2022,0.10099999999999999]
[null,"Spain","Males","25 to 74 years",2023,9.3000000000000013E-2]
[null,"Spain","Males","25 to 74 years",2024,8.8000000000000009E-2]
[null,"Sweden","Males","25 to 74 years",2010,6.4000000000000001E-2]
[null,"Sweden","Males","25 to 74 years",2011,5.7000000000000002E-2]
[null,"Sweden","Males","25 to 74 years",2012,0.06]
[null,"Sweden","Males","25 to 74 years",2013,0.06]
[null,"Sweden","Males","25 to 74 years",2014,6.0999999999999999E-2]
[null,"Sweden","Males","25 to 74 years",2015,5.9000000000000004E-2]
[null,"Sweden","Males","25 to 74 years",2016,5.7000000000000002E-2]
[null,"Sweden","Males","25 to 74 years",2017,5.5999999999999994E-2]
[null,"Sweden","Males","25 to 74 years",2018,5.0999999999999997E-2]
[null,"Sweden","Males","25 to 74 years",2019,5.0999999999999997E-2]
[null,"Sweden","Males","25 to 74 years",2020,6.5000000000000002E-2]
[null,"Sweden","Males","25 to 74 years",2021,6.6000000000000003E-2]
[null,"Sweden","Males","25 to 74 years",2022,5.2999999999999999E-2]
[null,"Sweden","Males","25 to 74 years",2023,5.5E-2]
[null,"Sweden","Males","25 to 74 years",2024,0.06]
[null,"Austria","Males","55 to 74 years",2010,2.7999999999999997E-2]
[null,"Austria","Males","55 to 74 years",2011,4.2000000000000003E-2]
[null,"Austria","Males","55 to 74 years",2012,3.7999999999999999E-2]
[null,"Austria","Males","55 to 74 years",2013,0.04]
[null,"Austria","Males","55 to 74 years",2014,4.4999999999999998E-2]
[null,"Austria","Males","55 to 74 years",2015,5.5E-2]
[null,"Austria","Males","55 to 74 years",2016,5.7999999999999996E-2]
[null,"Austria","Males","55 to 74 years",2017,4.8000000000000001E-2]
[null,"Austria","Males","55 to 74 years",2018,0.04]
[null,"Austria","Males","55 to 74 years",2019,3.7999999999999999E-2]
[null,"Austria","Males","55 to 74 years",2020,4.4999999999999998E-2]
[null,"Austria","Males","55 to 74 years",2021,5.2000000000000005E-2]
[null,"Austria","Males","55 to 74 years",2022,0.04]
[null,"Austria","Males","55 to 74 years",2023,4.5999999999999999E-2]
[null,"Austria","Males","55 to 74 years",2024,4.4000000000000004E-2]
[null,"Belgium","Males","55 to 74 years",2010,4.0999999999999995E-2]
[null,"Belgium","Males","55 to 74 years",2011,3.7000000000000005E-2]
[null,"Belgium","Males","55 to 74 years",2012,0.04]
[null,"Belgium","Males","55 to 74 years",2013,5.2000000000000005E-2]
[null,"Belgium","Males","55 to 74 years",2014,5.2999999999999999E-2]
[null,"Belgium","Males","55 to 74 years",2015,6.0999999999999999E-2]
[null,"Belgium","Males","55 to 74 years",2016,5.2000000000000005E-2]
[null,"Belgium","Males","55 to 74 years",2017,5.0999999999999997E-2]
[null,"Belgium","Males","55 to 74 years",2018,4.7E-2]
[null,"Belgium","Males","55 to 74 years",2019,4.0999999999999995E-2]
[null,"Belgium","Males","55 to 74 years",2020,4.5999999999999999E-2]
[null,"Belgium","Males","55 to 74 years",2021,4.8000000000000001E-2]
[null,"Belgium","Males","55 to 74 years",2022,3.7000000000000005E-2]
[null,"Belgium","Males","55 to 74 years",2023,3.5000000000000003E-2]
[null,"Belgium","Males","55 to 74 years",2024,3.4000000000000002E-2]
[null,"Bulgaria","Males","55 to 74 years",2010,9.6999999999999989E-2]
[null,"Bulgaria","Males","55 to 74 years",2011,9.6999999999999989E-2]
[null,"Bulgaria","Males","55 to 74 years",2012,0.11599999999999999]
[null,"Bulgaria","Males","55 to 74 years",2013,0.13500000000000001]
[null,"Bulgaria","Males","55 to 74 years",2014,0.13]
[null,"Bulgaria","Males","55 to 74 years",2015,9.8000000000000004E-2]
[null,"Bulgaria","Males","55 to 74 years",2016,8.4000000000000005E-2]
[null,"Bulgaria","Males","55 to 74 years",2017,7.0999999999999994E-2]
[null,"Bulgaria","Males","55 to 74 years",2018,6.0999999999999999E-2]
[null,"Bulgaria","Males","55 to 74 years",2019,4.8000000000000001E-2]
[null,"Bulgaria","Males","55 to 74 years",2020,0.05]
[null,"Bulgaria","Males","55 to 74 years",2021,4.5999999999999999E-2]
[null,"Bulgaria","Males","55 to 74 years",2022,3.7999999999999999E-2]
[null,"Bulgaria","Males","55 to 74 years",2023,3.5000000000000003E-2]
[null,"Bulgaria","Males","55 to 74 years",2024,0.03]
[null,"Croatia","Males","55 to 74 years",2010,6.5000000000000002E-2]
[null,"Croatia","Males","55 to 74 years",2011,7.9000000000000001E-2]
[null,"Croatia","Males","55 to 74 years",2012,0.1]
[null,"Croatia","Males","55 to 74 years",2013,0.109]
[null,"Croatia","Males","55 to 74 years",2014,0.11199999999999999]
[null,"Croatia","Males","55 to 74 years",2015,0.114]
[null,"Croatia","Males","55 to 74 years",2016,0.10199999999999999]
[null,"Croatia","Males","55 to 74 years",2017,7.0000000000000007E-2]
[null,"Croatia","Males","55 to 74 years",2018,4.4000000000000004E-2]
[null,"Croatia","Males","55 to 74 years",2019,2.7000000000000003E-2]
[null,"Croatia","Males","55 to 74 years",2020,4.2999999999999997E-2]
[null,"Croatia","Males","55 to 74 years",2021,3.9E-2]
[null,"Croatia","Males","55 to 74 years",2022,4.0999999999999995E-2]
[null,"Croatia","Males","55 to 74 years",2023,3.4000000000000002E-2]
[null,"Croatia","Males","55 to 74 years",2024,2.4E-2]
[null,"Cyprus","Males","55 to 74 years",2010,4.2999999999999997E-2]
[null,"Cyprus","Males","55 to 74 years",2011,4.4000000000000004E-2]
[null,"Cyprus","Males","55 to 74 years",2012,9.6000000000000002E-2]
[null,"Cyprus","Males","55 to 74 years",2013,0.13500000000000001]
[null,"Cyprus","Males","55 to 74 years",2014,0.161]
[null,"Cyprus","Males","55 to 74 years",2015,0.155]
[null,"Cyprus","Males","55 to 74 years",2016,0.12300000000000001]
[null,"Cyprus","Males","55 to 74 years",2017,8.3000000000000004E-2]
[null,"Cyprus","Males","55 to 74 years",2018,5.5999999999999994E-2]
[null,"Cyprus","Males","55 to 74 years",2019,5.5E-2]
[null,"Cyprus","Males","55 to 74 years",2020,5.4000000000000006E-2]
[null,"Cyprus","Males","55 to 74 years",2021,4.4999999999999998E-2]
[null,"Cyprus","Males","55 to 74 years",2022,4.4000000000000004E-2]
[null,"Cyprus","Males","55 to 74 years",2023,4.2000000000000003E-2]
[null,"Cyprus","Males","55 to 74 years",2024,2.7000000000000003E-2]
[null,"Czechia","Males","55 to 74 years",2010,6.0999999999999999E-2]
[null,"Czechia","Males","55 to 74 years",2011,5.5E-2]
[null,"Czechia","Males","55 to 74 years",2012,5.5E-2]
[null,"Czechia","Males","55 to 74 years",2013,0.05]
[null,"Czechia","Males","55 to 74 years",2014,4.2999999999999997E-2]
[null,"Czechia","Males","55 to 74 years",2015,3.7000000000000005E-2]
[null,"Czechia","Males","55 to 74 years",2016,3.4000000000000002E-2]
[null,"Czechia","Males","55 to 74 years",2017,1.9E-2]
[null,"Czechia","Males","55 to 74 years",2018,1.4999999999999999E-2]
[null,"Czechia","Males","55 to 74 years",2019,1.7000000000000001E-2]
[null,"Czechia","Males","55 to 74 years",2020,1.4999999999999999E-2]
[null,"Czechia","Males","55 to 74 years",2021,1.8000000000000002E-2]
[null,"Czechia","Males","55 to 74 years",2022,1.6E-2]
[null,"Czechia","Males","55 to 74 years",2023,1.9E-2]
[null,"Czechia","Males","55 to 74 years",2024,1.7000000000000001E-2]
[null,"Denmark","Males","55 to 74 years",2010,0.06]
[null,"Denmark","Males","55 to 74 years",2011,5.7000000000000002E-2]
[null,"Denmark","Males","55 to 74 years",2012,4.8000000000000001E-2]
[null,"Denmark","Males","55 to 74 years",2013,4.5999999999999999E-2]
[null,"Denmark","Males","55 to 74 years",2014,4.5999999999999999E-2]
[null,"Denmark","Males","55 to 74 years",2015,3.3000000000000002E-2]
[null,"Denmark","Males","55 to 74 years",2016,3.6000000000000004E-2]
[null,"Denmark","Males","55 to 74 years",2017,3.3000000000000002E-2]
[null,"Denmark","Males","55 to 74 years",2018,2.8999999999999998E-2]
[null,"Denmark","Males","55 to 74 years",2019,0.03]
[null,"Denmark","Males","55 to 74 years",2020,3.7000000000000005E-2]
[null,"Denmark","Males","55 to 74 years",2021,4.2000000000000003E-2]
[null,"Denmark","Males","55 to 74 years",2022,0.03]
[null,"Denmark","Males","55 to 74 years",2023,2.8999999999999998E-2]
[null,"Denmark","Males","55 to 74 years",2024,3.7999999999999999E-2]
[null,"Estonia","Males","55 to 74 years",2010,0.16800000000000001]
[null,"Estonia","Males","55 to 74 years",2011,0.13100000000000001]
[null,"Estonia","Males","55 to 74 years",2012,8.4000000000000005E-2]
[null,"Estonia","Males","55 to 74 years",2013,7.6999999999999999E-2]
[null,"Estonia","Males","55 to 74 years",2014,5.4000000000000006E-2]
[null,"Estonia","Males","55 to 74 years",2015,6.2E-2]
[null,"Estonia","Males","55 to 74 years",2016,8.3000000000000004E-2]
[null,"Estonia","Males","55 to 74 years",2017,6.8000000000000005E-2]
[null,"Estonia","Males","55 to 74 years",2018,6.7000000000000004E-2]
[null,"Estonia","Males","55 to 74 years",2019,4.4999999999999998E-2]
[null,"Estonia","Males","55 to 74 years",2020,7.2999999999999995E-2]
[null,"Estonia","Males","55 to 74 years",2021,6.5000000000000002E-2]
[null,"Estonia","Males","55 to 74 years",2022,4.5999999999999999E-2]
[null,"Estonia","Males","55 to 74 years",2023,5.0999999999999997E-2]
[null,"Estonia","Males","55 to 74 years",2024,6.0999999999999999E-2]
[null,"Finland","Males","55 to 74 years",2010,7.0000000000000007E-2]
[null,"Finland","Males","55 to 74 years",2011,7.0000000000000007E-2]
[null,"Finland","Males","55 to 74 years",2012,7.4999999999999997E-2]
[null,"Finland","Males","55 to 74 years",2013,7.400000000000001E-2]
[null,"Finland","Males","55 to 74 years",2014,7.400000000000001E-2]
[null,"Finland","Males","55 to 74 years",2015,8.199999999999999E-2]
[null,"Finland","Males","55 to 74 years",2016,7.400000000000001E-2]
[null,"Finland","Males","55 to 74 years",2017,7.6999999999999999E-2]
[null,"Finland","Males","55 to 74 years",2018,7.0999999999999994E-2]
[null,"Finland","Males","55 to 74 years",2019,7.2000000000000008E-2]
[null,"Finland","Males","55 to 74 years",2020,7.0000000000000007E-2]
[null,"Finland","Males","55 to 74 years",2021,7.0000000000000007E-2]
[null,"Finland","Males","55 to 74 years",2022,0.08]
[null,"Finland","Males","55 to 74 years",2023,0.08]
[null,"Finland","Males","55 to 74 years",2024,8.4000000000000005E-2]
[null,"France","Males","55 to 74 years",2010,0.06]
[null,"France","Males","55 to 74 years",2011,5.7999999999999996E-2]
[null,"France","Males","55 to 74 years",2012,6.4000000000000001E-2]
[null,"France","Males","55 to 74 years",2013,7.4999999999999997E-2]
[null,"France","Males","55 to 74 years",2014,7.8E-2]
[null,"France","Males","55 to 74 years",2015,7.6999999999999999E-2]
[null,"France","Males","55 to 74 years",2016,7.8E-2]
[null,"France","Males","55 to 74 years",2017,7.2000000000000008E-2]
[null,"France","Males","55 to 74 years",2018,6.9000000000000006E-2]
[null,"France","Males","55 to 74 years",2019,6.5000000000000002E-2]
[null,"France","Males","55 to 74 years",2020,5.5999999999999994E-2]
[null,"France","Males","55 to 74 years",2021,6.3E-2]
[null,"France","Males","55 to 74 years",2022,5.5999999999999994E-2]
[null,"France","Males","55 to 74 years",2023,5.4000000000000006E-2]
[null,"France","Males","55 to 74 years",2024,5.2000000000000005E-2]
[null,"Germany","Males","55 to 74 years",2010,6.7000000000000004E-2]
[null,"Germany","Males","55 to 74 years",2011,5.5E-2]
[null,"Germany","Males","55 to 74 years",2012,5.0999999999999997E-2]
[null,"Germany","Males","55 to 74 years",2013,5.0999999999999997E-2]
[null,"Germany","Males","55 to 74 years",2014,4.5999999999999999E-2]
[null,"Germany","Males","55 to 74 years",2015,4.2999999999999997E-2]
[null,"Germany","Males","55 to 74 years",2016,3.4000000000000002E-2]
[null,"Germany","Males","55 to 74 years",2017,0.03]
[null,"Germany","Males","55 to 74 years",2018,2.7000000000000003E-2]
[null,"Germany","Males","55 to 74 years",2019,2.5000000000000001E-2]
[null,"Germany","Males","55 to 74 years",2020,2.7999999999999997E-2]
[null,"Germany","Males","55 to 74 years",2021,3.1E-2]
[null,"Germany","Males","55 to 74 years",2022,2.7000000000000003E-2]
[null,"Germany","Males","55 to 74 years",2023,2.4E-2]
[null,"Germany","Males","55 to 74 years",2024,2.3E-2]
[null,"Greece","Males","55 to 74 years",2010,5.5999999999999994E-2]
[null,"Greece","Males","55 to 74 years",2011,0.08]
[null,"Greece","Males","55 to 74 years",2012,0.13]
[null,"Greece","Males","55 to 74 years",2013,0.16200000000000001]
[null,"Greece","Males","55 to 74 years",2014,0.17399999999999999]
[null,"Greece","Males","55 to 74 years",2015,0.17699999999999999]
[null,"Greece","Males","55 to 74 years",2016,0.192]
[null,"Greece","Males","55 to 74 years",2017,0.17]
[null,"Greece","Males","55 to 74 years",2018,0.13300000000000001]
[null,"Greece","Males","55 to 74 years",2019,0.122]
[null,"Greece","Males","55 to 74 years",2020,0.121]
[null,"Greece","Males","55 to 74 years",2021,8.6999999999999994E-2]
[null,"Greece","Males","55 to 74 years",2022,7.2999999999999995E-2]
[null,"Greece","Males","55 to 74 years",2023,5.0999999999999997E-2]
[null,"Greece","Males","55 to 74 years",2024,5.0999999999999997E-2]
[null,"Hungary","Males","55 to 74 years",2010,0.08]
[null,"Hungary","Males","55 to 74 years",2011,9.4E-2]
[null,"Hungary","Males","55 to 74 years",2012,8.3000000000000004E-2]
[null,"Hungary","Males","55 to 74 years",2013,8.1000000000000003E-2]
[null,"Hungary","Males","55 to 74 years",2014,6.5000000000000002E-2]
[null,"Hungary","Males","55 to 74 years",2015,5.7999999999999996E-2]
[null,"Hungary","Males","55 to 74 years",2016,4.0999999999999995E-2]
[null,"Hungary","Males","55 to 74 years",2017,2.8999999999999998E-2]
[null,"Hungary","Males","55 to 74 years",2018,2.1000000000000001E-2]
[null,"Hungary","Males","55 to 74 years",2019,2.2000000000000002E-2]
[null,"Hungary","Males","55 to 74 years",2020,0.03]
[null,"Hungary","Males","55 to 74 years",2021,3.1E-2]
[null,"Hungary","Males","55 to 74 years",2022,0.03]
[null,"Hungary","Males","55 to 74 years",2023,3.1E-2]
[null,"Hungary","Males","55 to 74 years",2024,3.3000000000000002E-2]
[null,"Ireland","Males","55 to 74 years",2010,8.8000000000000009E-2]
[null,"Ireland","Males","55 to 74 years",2011,9.8000000000000004E-2]
[null,"Ireland","Males","55 to 74 years",2012,0.109]
[null,"Ireland","Males","55 to 74 years",2013,0.10300000000000001]
[null,"Ireland","Males","55 to 74 years",2014,8.900000000000001E-2]
[null,"Ireland","Males","55 to 74 years",2015,7.400000000000001E-2]
[null,"Ireland","Males","55 to 74 years",2016,6.3E-2]
[null,"Ireland","Males","55 to 74 years",2017,5.0999999999999997E-2]
[null,"Ireland","Males","55 to 74 years",2018,4.2999999999999997E-2]
[null,"Ireland","Males","55 to 74 years",2019,3.2000000000000001E-2]
[null,"Ireland","Males","55 to 74 years",2020,3.9E-2]
[null,"Ireland","Males","55 to 74 years",2021,4.9000000000000002E-2]
[null,"Ireland","Males","55 to 74 years",2022,0.03]
[null,"Ireland","Males","55 to 74 years",2023,2.7999999999999997E-2]
[null,"Ireland","Males","55 to 74 years",2024,2.7000000000000003E-2]
[null,"Italy","Males","55 to 74 years",2010,3.7000000000000005E-2]
[null,"Italy","Males","55 to 74 years",2011,4.2000000000000003E-2]
[null,"Italy","Males","55 to 74 years",2012,5.5E-2]
[null,"Italy","Males","55 to 74 years",2013,6.3E-2]
[null,"Italy","Males","55 to 74 years",2014,5.7000000000000002E-2]
[null,"Italy","Males","55 to 74 years",2015,5.9000000000000004E-2]
[null,"Italy","Males","55 to 74 years",2016,5.9000000000000004E-2]
[null,"Italy","Males","55 to 74 years",2017,5.7999999999999996E-2]
[null,"Italy","Males","55 to 74 years",2018,5.7999999999999996E-2]
[null,"Italy","Males","55 to 74 years",2019,5.4000000000000006E-2]
[null,"Italy","Males","55 to 74 years",2020,4.8000000000000001E-2]
[null,"Italy","Males","55 to 74 years",2021,5.2999999999999999E-2]
[null,"Italy","Males","55 to 74 years",2022,4.4999999999999998E-2]
[null,"Italy","Males","55 to 74 years",2023,4.2000000000000003E-2]
[null,"Italy","Males","55 to 74 years",2024,3.4000000000000002E-2]
[null,"Latvia","Males","55 to 74 years",2010,0.183]
[null,"Latvia","Males","55 to 74 years",2011,0.156]
[null,"Latvia","Males","55 to 74 years",2012,0.14099999999999999]
[null,"Latvia","Males","55 to 74 years",2013,0.10400000000000001]
[null,"Latvia","Males","55 to 74 years",2014,0.10300000000000001]
[null,"Latvia","Males","55 to 74 years",2015,0.10099999999999999]
[null,"Latvia","Males","55 to 74 years",2016,0.10300000000000001]
[null,"Latvia","Males","55 to 74 years",2017,9.0999999999999998E-2]
[null,"Latvia","Males","55 to 74 years",2018,7.9000000000000001E-2]
[null,"Latvia","Males","55 to 74 years",2019,6.8000000000000005E-2]
[null,"Latvia","Males","55 to 74 years",2020,8.199999999999999E-2]
[null,"Latvia","Males","55 to 74 years",2021,5.5E-2]
[null,"Latvia","Males","55 to 74 years",2022,6.2E-2]
[null,"Latvia","Males","55 to 74 years",2023,6.2E-2]
[null,"Latvia","Males","55 to 74 years",2024,6.5000000000000002E-2]
[null,"Lithuania","Males","55 to 74 years",2010,0.153]
[null,"Lithuania","Males","55 to 74 years",2011,0.14300000000000002]
[null,"Lithuania","Males","55 to 74 years",2012,0.11900000000000001]
[null,"Lithuania","Males","55 to 74 years",2013,0.124]
[null,"Lithuania","Males","55 to 74 years",2014,0.124]
[null,"Lithuania","Males","55 to 74 years",2015,9.6000000000000002E-2]
[null,"Lithuania","Males","55 to 74 years",2016,8.4000000000000005E-2]
[null,"Lithuania","Males","55 to 74 years",2017,7.4999999999999997E-2]
[null,"Lithuania","Males","55 to 74 years",2018,6.7000000000000004E-2]
[null,"Lithuania","Males","55 to 74 years",2019,6.0999999999999999E-2]
[null,"Lithuania","Males","55 to 74 years",2020,9.0999999999999998E-2]
[null,"Lithuania","Males","55 to 74 years",2021,7.400000000000001E-2]
[null,"Lithuania","Males","55 to 74 years",2022,6.0999999999999999E-2]
[null,"Lithuania","Males","55 to 74 years",2023,8.1000000000000003E-2]
[null,"Lithuania","Males","55 to 74 years",2024,8.8000000000000009E-2]
[null,"Luxembourg","Males","55 to 74 years",2010]
[null,"Luxembourg","Males","55 to 74 years",2011]
[null,"Luxembourg","Males","55 to 74 years",2012]
[null,"Luxembourg","Males","55 to 74 years",2013,3.9E-2]
[null,"Luxembourg","Males","55 to 74 years",2014,4.2000000000000003E-2]
[null,"Luxembourg","Males","55 to 74 years",2015,5.0999999999999997E-2]
[null,"Luxembourg","Males","55 to 74 years",2016,5.4000000000000006E-2]
[null,"Luxembourg","Males","55 to 74 years",2017,3.2000000000000001E-2]
[null,"Luxembourg","Males","55 to 74 years",2018,3.9E-2]
[null,"Luxembourg","Males","55 to 74 years",2019,4.5999999999999999E-2]
[null,"Luxembourg","Males","55 to 74 years",2020,4.8000000000000001E-2]
[null,"Luxembourg","Males","55 to 74 years",2021,5.0999999999999997E-2]
[null,"Luxembourg","Males","55 to 74 years",2022,4.5999999999999999E-2]
[null,"Luxembourg","Males","55 to 74 years",2023]
[null,"Luxembourg","Males","55 to 74 years",2024]
[null,"Malta","Males","55 to 74 years",2010,4.0999999999999995E-2]
[null,"Malta","Males","55 to 74 years",2011,2.7000000000000003E-2]
[null,"Malta","Males","55 to 74 years",2012,3.3000000000000002E-2]
[null,"Malta","Males","55 to 74 years",2013,4.5999999999999999E-2]
[null,"Malta","Males","55 to 74 years",2014,6.2E-2]
[null,"Malta","Males","55 to 74 years",2015,5.5E-2]
[null,"Malta","Males","55 to 74 years",2016,3.5000000000000003E-2]
[null,"Malta","Males","55 to 74 years",2017,2.2000000000000002E-2]
[null,"Malta","Males","55 to 74 years",2018,0.03]
[null,"Malta","Males","55 to 74 years",2019]
[null,"Malta","Males","55 to 74 years",2020,3.1E-2]
[null,"Malta","Males","55 to 74 years",2021,2.7000000000000003E-2]
[null,"Malta","Males","55 to 74 years",2022,2.3E-2]
[null,"Malta","Males","55 to 74 years",2023]
[null,"Malta","Males","55 to 74 years",2024,2.8999999999999998E-2]
[null,"Netherlands","Males","55 to 74 years",2010,4.8000000000000001E-2]
[null,"Netherlands","Males","55 to 74 years",2011,5.2000000000000005E-2]
[null,"Netherlands","Males","55 to 74 years",2012,5.9000000000000004E-2]
[null,"Netherlands","Males","55 to 74 years",2013,7.5999999999999998E-2]
[null,"Netherlands","Males","55 to 74 years",2014,8.5000000000000006E-2]
[null,"Netherlands","Males","55 to 74 years",2015,8.6999999999999994E-2]
[null,"Netherlands","Males","55 to 74 years",2016,7.2000000000000008E-2]
[null,"Netherlands","Males","55 to 74 years",2017,5.7999999999999996E-2]
[null,"Netherlands","Males","55 to 74 years",2018,4.8000000000000001E-2]
[null,"Netherlands","Males","55 to 74 years",2019,4.0999999999999995E-2]
[null,"Netherlands","Males","55 to 74 years",2020,3.3000000000000002E-2]
[null,"Netherlands","Males","55 to 74 years",2021,3.3000000000000002E-2]
[null,"Netherlands","Males","55 to 74 years",2022,2.7999999999999997E-2]
[null,"Netherlands","Males","55 to 74 years",2023,2.3E-2]
[null,"Netherlands","Males","55 to 74 years",2024,2.4E-2]
[null,"Poland","Males","55 to 74 years",2010,7.4999999999999997E-2]
[null,"Poland","Males","55 to 74 years",2011,7.400000000000001E-2]
[null,"Poland","Males","55 to 74 years",2012,0.08]
[null,"Poland","Males","55 to 74 years",2013,8.3000000000000004E-2]
[null,"Poland","Males","55 to 74 years",2014,7.0000000000000007E-2]
[null,"Poland","Males","55 to 74 years",2015,5.7000000000000002E-2]
[null,"Poland","Males","55 to 74 years",2016,4.9000000000000002E-2]
[null,"Poland","Males","55 to 74 years",2017,3.9E-2]
[null,"Poland","Males","55 to 74 years",2018,3.2000000000000001E-2]
[null,"Poland","Males","55 to 74 years",2019,2.5000000000000001E-2]
[null,"Poland","Males","55 to 74 years",2020,2.4E-2]
[null,"Poland","Males","55 to 74 years",2021,2.4E-2]
[null,"Poland","Males","55 to 74 years",2022,1.8000000000000002E-2]
[null,"Poland","Males","55 to 74 years",2023,1.9E-2]
[null,"Poland","Males","55 to 74 years",2024,2.2000000000000002E-2]
[null,"Portugal","Males","55 to 74 years",2010,0.106]
[null,"Portugal","Males","55 to 74 years",2011,0.11599999999999999]
[null,"Portugal","Males","55 to 74 years",2012,0.14499999999999999]
[null,"Portugal","Males","55 to 74 years",2013,0.14800000000000002]
[null,"Portugal","Males","55 to 74 years",2014,0.15]
[null,"Portugal","Males","55 to 74 years",2015,0.13699999999999998]
[null,"Portugal","Males","55 to 74 years",2016,0.121]
[null,"Portugal","Males","55 to 74 years",2017,8.8000000000000009E-2]
[null,"Portugal","Males","55 to 74 years",2018,6.2E-2]
[null,"Portugal","Males","55 to 74 years",2019,5.7000000000000002E-2]
[null,"Portugal","Males","55 to 74 years",2020,6.2E-2]
[null,"Portugal","Males","55 to 74 years",2021,5.5E-2]
[null,"Portugal","Males","55 to 74 years",2022,0.04]
[null,"Portugal","Males","55 to 74 years",2023,4.7E-2]
[null,"Portugal","Males","55 to 74 years",2024,4.7E-2]
[null,"Romania","Males","55 to 74 years",2010,0.06]
[null,"Romania","Males","55 to 74 years",2011,6.7000000000000004E-2]
[null,"Romania","Males","55 to 74 years",2012,5.7999999999999996E-2]
[null,"Romania","Males","55 to 74 years",2013,5.9000000000000004E-2]
[null,"Romania","Males","55 to 74 years",2014,5.2999999999999999E-2]
[null,"Romania","Males","55 to 74 years",2015,5.7999999999999996E-2]
[null,"Romania","Males","55 to 74 years",2016,4.7E-2]
[null,"Romania","Males","55 to 74 years",2017,4.4999999999999998E-2]
[null,"Romania","Males","55 to 74 years",2018,3.7000000000000005E-2]
[null,"Romania","Males","55 to 74 years",2019,3.2000000000000001E-2]
[null,"Romania","Males","55 to 74 years",2020,4.0999999999999995E-2]
[null,"Romania","Males","55 to 74 years",2021,4.0999999999999995E-2]
[null,"Romania","Males","55 to 74 years",2022,0.04]
[null,"Romania","Males","55 to 74 years",2023,0.04]
[null,"Romania","Males","55 to 74 years",2024,2.5000000000000001E-2]
[null,"Slovakia","Males","55 to 74 years",2010,9.0999999999999998E-2]
[null,"Slovakia","Males","55 to 74 years",2011,0.10099999999999999]
[null,"Slovakia","Males","55 to 74 years",2012,0.105]
[null,"Slovakia","Males","55 to 74 years",2013,0.10199999999999999]
[null,"Slovakia","Males","55 to 74 years",2014,9.4E-2]
[null,"Slovakia","Males","55 to 74 years",2015,7.8E-2]
[null,"Slovakia","Males","55 to 74 years",2016,7.9000000000000001E-2]
[null,"Slovakia","Males","55 to 74 years",2017,5.2999999999999999E-2]
[null,"Slovakia","Males","55 to 74 years",2018,4.0999999999999995E-2]
[null,"Slovakia","Males","55 to 74 years",2019,3.6000000000000004E-2]
[null,"Slovakia","Males","55 to 74 years",2020,0.04]
[null,"Slovakia","Males","55 to 74 years",2021,4.8000000000000001E-2]
[null,"Slovakia","Males","55 to 74 years",2022,4.0999999999999995E-2]
[null,"Slovakia","Males","55 to 74 years",2023,3.3000000000000002E-2]
[null,"Slovakia","Males","55 to 74 years",2024,2.7000000000000003E-2]
[null,"Slovenia","Males","55 to 74 years",2010,3.5000000000000003E-2]
[null,"Slovenia","Males","55 to 74 years",2011,6.5000000000000002E-2]
[null,"Slovenia","Males","55 to 74 years",2012,5.9000000000000004E-2]
[null,"Slovenia","Males","55 to 74 years",2013,6.6000000000000003E-2]
[null,"Slovenia","Males","55 to 74 years",2014,7.4999999999999997E-2]
[null,"Slovenia","Males","55 to 74 years",2015,7.400000000000001E-2]
[null,"Slovenia","Males","55 to 74 years",2016,6.9000000000000006E-2]
[null,"Slovenia","Males","55 to 74 years",2017,6.6000000000000003E-2]
[null,"Slovenia","Males","55 to 74 years",2018,4.7E-2]
[null,"Slovenia","Males","55 to 74 years",2019,4.2000000000000003E-2]
[null,"Slovenia","Males","55 to 74 years",2020,3.2000000000000001E-2]
[null,"Slovenia","Males","55 to 74 years",2021,3.7999999999999999E-2]
[null,"Slovenia","Males","55 to 74 years",2022,0.04]
[null,"Slovenia","Males","55 to 74 years",2023,3.7000000000000005E-2]
[null,"Slovenia","Males","55 to 74 years",2024,3.9E-2]
[null,"Spain","Males","55 to 74 years",2010,0.13900000000000001]
[null,"Spain","Males","55 to 74 years",2011,0.14699999999999999]
[null,"Spain","Males","55 to 74 years",2012,0.17399999999999999]
[null,"Spain","Males","55 to 74 years",2013,0.19699999999999998]
[null,"Spain","Males","55 to 74 years",2014,0.19800000000000001]
[null,"Spain","Males","55 to 74 years",2015,0.17899999999999999]
[null,"Spain","Males","55 to 74 years",2016,0.16300000000000001]
[null,"Spain","Males","55 to 74 years",2017,0.14300000000000002]
[null,"Spain","Males","55 to 74 years",2018,0.12300000000000001]
[null,"Spain","Males","55 to 74 years",2019,0.113]
[null,"Spain","Males","55 to 74 years",2020,0.11]
[null,"Spain","Males","55 to 74 years",2021,0.113]
[null,"Spain","Males","55 to 74 years",2022,0.1]
[null,"Spain","Males","55 to 74 years",2023,9.5000000000000001E-2]
[null,"Spain","Males","55 to 74 years",2024,8.8000000000000009E-2]
[null,"Sweden","Males","55 to 74 years",2010,0.06]
[null,"Sweden","Males","55 to 74 years",2011,5.2999999999999999E-2]
[null,"Sweden","Males","55 to 74 years",2012,5.0999999999999997E-2]
[null,"Sweden","Males","55 to 74 years",2013,5.2000000000000005E-2]
[null,"Sweden","Males","55 to 74 years",2014,5.5E-2]
[null,"Sweden","Males","55 to 74 years",2015,5.2999999999999999E-2]
[null,"Sweden","Males","55 to 74 years",2016,5.4000000000000006E-2]
[null,"Sweden","Males","55 to 74 years",2017,5.0999999999999997E-2]
[null,"Sweden","Males","55 to 74 years",2018,4.4999999999999998E-2]
[null,"Sweden","Males","55 to 74 years",2019,4.5999999999999999E-2]
[null,"Sweden","Males","55 to 74 years",2020,5.7000000000000002E-2]
[null,"Sweden","Males","55 to 74 years",2021,6.9000000000000006E-2]
[null,"Sweden","Males","55 to 74 years",2022,5.4000000000000006E-2]
[null,"Sweden","Males","55 to 74 years",2023,5.2000000000000005E-2]
[null,"Sweden","Males","55 to 74 years",2024,5.9000000000000004E-2]
[]
[null,"Last row",null,null,null,"End of worksheet"]

{"sheet":"control","index":2,"n_rows":128,"n_cols":27,"rows_kept":128,"cut":false,"hidden":false,"merged":[]}
[]
[null,"Control"]
[]
[null,"Categories and user selections"]
[]
[null,"Selected Gender",{"$f":"INDEX(t_gender[Gender],MATCH(1,t_gender[Selected],0))","v":"Total"}]
[null,"Previous Gender","Total","used by VBA routines, do not change"]
[]
[null,null,"Gender","Selected"]
[null,null,"Total",{"$f":"SUBTOTAL(3,C10)","v":1}]
[null,null,"Females",0]
[null,null,"Males",0]
[]
[null,"Selected Age Class",{"$f":"INDEX(t_age_class[Age_class],MATCH(1,t_age_class[Selected],0))","v":"15 to 29 years"}]
[null,"Previous Age Class","15 to 29 years","used by VBA routines, do not change"]
[]
[null,null,"Age_class","Selected"]
[null,null,"15 to 24 years",{"$f":"SUBTOTAL(3,C18)","v":0}]
[null,null,"15 to 29 years",1]
[null,null,"15 to 74 years",0]
[null,null,"20 to 64 years",0]
[null,null,"25 to 54 years",0]
[null,null,"25 to 74 years",{"$f":"SUBTOTAL(3,C23)","v":0}]
[null,null,"55 to 74 years",{"$f":"SUBTOTAL(3,C24)","v":0}]
[]
[null,"Selected Country",{"$f":"INDEX(t_countries[Countries],MATCH(1,t_countries[Selected],0))","v":"Italy"}]
[null,"Previous Year","Italy","used by VBA routines, do not change"]
[]
[null,null,"Countries","Selected"]
[null,null,"Austria",{"$f":"SUBTOTAL(3,t_countries[[#This Row],[Countries]])","v":0}]
[null,null,"Belgium",{"$f":"SUBTOTAL(3,t_countries[[#This Row],[Countries]])","v":0}]
[null,null,"Bulgaria",{"$f":"SUBTOTAL(3,t_countries[[#This Row],[Countries]])","v":0}]
[null,null,"Croatia",{"$f":"SUBTOTAL(3,t_countries[[#This Row],[Countries]])","v":0}]
[null,null,"Cyprus",{"$f":"SUBTOTAL(3,t_countries[[#This Row],[Countries]])","v":0}]
[null,null,"Czechia",{"$f":"SUBTOTAL(3,t_countries[[#This Row],[Countries]])","v":0}]
[null,null,"Denmark",{"$f":"SUBTOTAL(3,t_countries[[#This Row],[Countries]])","v":0}]
[null,null,"Estonia",{"$f":"SUBTOTAL(3,t_countries[[#This Row],[Countries]])","v":0}]
[null,null,"Finland",{"$f":"SUBTOTAL(3,t_countries[[#This Row],[Countries]])","v":0}]
[null,null,"France",{"$f":"SUBTOTAL(3,t_countries[[#This Row],[Countries]])","v":0}]
[null,null,"Germany",{"$f":"SUBTOTAL(3,t_countries[[#This Row],[Countries]])","v":0}]
[null,null,"Greece",{"$f":"SUBTOTAL(3,t_countries[[#This Row],[Countries]])","v":0}]
[null,null,"Hungary",{"$f":"SUBTOTAL(3,t_countries[[#This Row],[Countries]])","v":0}]
[null,null,"Ireland",{"$f":"SUBTOTAL(3,t_countries[[#This Row],[Countries]])","v":0}]
[null,null,"Italy",{"$f":"SUBTOTAL(3,t_countries[[#This Row],[Countries]])","v":1}]
[null,null,"Latvia",{"$f":"SUBTOTAL(3,t_countries[[#This Row],[Countries]])","v":0}]
[null,null,"Lithuania",{"$f":"SUBTOTAL(3,t_countries[[#This Row],[Countries]])","v":0}]
[null,null,"Luxembourg",{"$f":"SUBTOTAL(3,t_countries[[#This Row],[Countries]])","v":0}]
[null,null,"Malta",{"$f":"SUBTOTAL(3,t_countries[[#This Row],[Countries]])","v":0}]
[null,null,"Netherlands",{"$f":"SUBTOTAL(3,t_countries[[#This Row],[Countries]])","v":0}]
[null,null,"Poland",{"$f":"SUBTOTAL(3,t_countries[[#This Row],[Countries]])","v":0}]
[null,null,"Portugal",{"$f":"SUBTOTAL(3,t_countries[[#This Row],[Countries]])","v":0}]
[null,null,"Romania",{"$f":"SUBTOTAL(3,t_countries[[#This Row],[Countries]])","v":0}]
[null,null,"Slovakia",{"$f":"SUBTOTAL(3,t_countries[[#This Row],[Countries]])","v":0}]
[null,null,"Slovenia",{"$f":"SUBTOTAL(3,t_countries[[#This Row],[Countries]])","v":0}]
[null,null,"Spain",{"$f":"SUBTOTAL(3,t_countries[[#This Row],[Countries]])","v":0}]
[null,null,"Sweden",{"$f":"SUBTOTAL(3,t_countries[[#This Row],[Countries]])","v":0}]
[]
[null,"Selected Year",{"$f":"INDEX(t_years[Years],MATCH(1,t_years[Selected],0))","v":2023}]
[null,"Previous Year",2023,"used by VBA routines, do not change"]
[]
[null,null,"Years","Selected"]
[null,null,2010,{"$f":"SUBTOTAL(3,t_years[[#This Row],[Years]])","v":0}]
[null,null,2011,{"$f":"SUBTOTAL(3,t_years[[#This Row],[Years]])","v":0}]
[null,null,2012,{"$f":"SUBTOTAL(3,t_years[[#This Row],[Years]])","v":0}]
[null,null,2013,{"$f":"SUBTOTAL(3,t_years[[#This Row],[Years]])","v":0}]
[null,null,2014,{"$f":"SUBTOTAL(3,t_years[[#This Row],[Years]])","v":0}]
[null,null,2015,{"$f":"SUBTOTAL(3,t_years[[#This Row],[Years]])","v":0}]
[null,null,2016,{"$f":"SUBTOTAL(3,t_years[[#This Row],[Years]])","v":0}]
[null,null,2017,{"$f":"SUBTOTAL(3,t_years[[#This Row],[Years]])","v":0}]
[null,null,2018,{"$f":"SUBTOTAL(3,t_years[[#This Row],[Years]])","v":0}]
[null,null,2019,{"$f":"SUBTOTAL(3,t_years[[#This Row],[Years]])","v":0}]
[null,null,2020,{"$f":"SUBTOTAL(3,t_years[[#This Row],[Years]])","v":0}]
[null,null,2021,{"$f":"SUBTOTAL(3,t_years[[#This Row],[Years]])","v":0}]
[null,null,2022,{"$f":"SUBTOTAL(3,t_years[[#This Row],[Years]])","v":0}]
[null,null,2023,{"$f":"SUBTOTAL(3,t_years[[#This Row],[Years]])","v":1}]
[null,null,2024,{"$f":"SUBTOTAL(3,t_years[[#This Row],[Years]])","v":0}]
[]
[null,"Selected chart",1,"Band or line chart"]
[]
[null,"Horizontal Offset",5]
[null,"Vertical Offset",10]
[]
[null,"Selected color scheme",1]
[]
[null,"Color Schemes Choropleth Map"]
[]
[null,null,null,null,"Select a color scheme"]
[]
[null,null,null,null,null,"Contrast",null,null,null,null,null,"No Scale","Highlight",null,"Focus",null,"Loaded",null,"Pairs, Triplets, Quads, Quints",null,null,null,"Stepped",null,null,"Smear"]
[null,null,"Threshold","RGB","Legend",1,{"$f":"F90+1","v":2},{"$f":"G90+1","v":3},4,5,6,7,8,{"$f":"M90+1","v":9},{"$f":"N90+1","v":10},{"$f":"O90+1","v":11},{"$f":"P90+1","v":12},{"$f":"Q90+1","v":13},{"$f":"R90+1","v":14},{"$f":"S90+1","v":15},{"$f":"T90+1","v":16},{"$f":"U90+1","v":17},{"$f":"V90+1","v":18},{"$f":"W90+1","v":19},{"$f":"X90+1","v":20},{"$f":"Y90+1","v":21},{"$f":"Z90+1","v":22}]
[null,null,null,8421504,"no data"]
[null,null,{"$f":"calcs!F184","v":0.02},3631104,{"$f":"calcs!G184","v":"0% to 2%"}]
[null,null,{"$f":"calcs!F185","v":0.04},5281818,{"$f":"calcs!G185","v":"2% to 4%"}]
[null,null,{"$f":"calcs!F186","v":0.06},6536550,{"$f":"calcs!G186","v":"4% to 6%"}]
[null,null,{"$f":"calcs!F187","v":0.08},7002534,{"$f":"calcs!G187","v":"6% to 8%"}]
[null,null,{"$f":"calcs!F188","v":0.1},9170905,{"$f":"calcs!G188","v":"8% to 10%"}]
[null,null,{"$f":"calcs!F189","v":0.12000000000000001},9167102,{"$f":"calcs!G189","v":"10% to 12%"}]
[null,null,{"$f":"calcs!F190","v":0.14000000000000001},6401789,{"$f":"calcs!G190","v":"12% to 14%"}]
[null,null,{"$f":"calcs!F191","v":0.16},4419060,{"$f":"calcs!G191","v":"14% to 16%"}]
[null,null,{"$f":"calcs!F192","v":0.18},2568407,{"$f":"calcs!G192","v":"16% to 18%"}]
[null,null,{"$f":"calcs!F193","v":1},2490533,{"$f":"calcs!G193","v":"18% or more"}]
[]
[null,"Color Scales",1,"Green to Red Contrast"]
[null,null,2,"Green to Pink Contrast"]
[null,null,3,"Green to Purple Contrast"]
[null,null,4,"Red to Blue Contrast"]
[null,null,5,"Blue to Red Contrast"]
[null,null,6,"Spectral"]
[null,null,7,"Light, No Scale"]
[null,null,8,"Brown Highlight High"]
[null,null,9,"Brown Highlight Low"]
[null,null,10,"High Focus"]
[null,null,11,"Low Focus"]
[null,null,12,"Center Loaded"]
[null,null,13,"Outlier Loaded"]
[null,null,14,"Pairs"]
[null,null,15,"Triplets"]
[null,null,16,"Quads"]
[null,null,17,"Quints"]
[null,null,18,"Blue Purple Stepped"]
[null,null,19,"Blue Stepped Red Tips"]
[null,null,20,"Blue Green Stepped"]
[null,null,21,"Blue Smear"]
[null,null,22,"Green Smear"]
[]
[null,null,null,null,"Recreate the shape index after you inserted a new map or added new shapes"]
[]
[null,"Last row",null,null,null,null,null,null,null,null,null,null,null,null,null,null,null,null,null,null,null,null,null,null,null,null,"End of worksheet"]

{"sheet":"calcs","index":3,"n_rows":195,"n_cols":18,"rows_kept":195,"cut":false,"hidden":false,"merged":[]}
[]
[null,"Calculations"]
[]
[null,"Current selections"]
[]
[null,null,"Country Index",{"$f":"MATCH(myCurrentCountry,_xlfn.ANCHORARRAY(C14),0)","v":15}]
[null,null,"Shape name",{"$f":"_xlfn.XLOOKUP(myCurrentCountry,_xlfn.ANCHORARRAY($C$150),myShapeNames)","v":"S_ITA"}]
[null,null,"Year Index",{"$f":"MATCH(myCurrentYear,_xlfn.ANCHORARRAY(D13),0)","v":14}]
[]
[null,"Cross Tab Country by Year for selected Gender and Age Class"]
[]
[null,null,null,{"$f":"_xlfn.SEQUENCE(,COUNTA(_xlfn.ANCHORARRAY(D13)))","v":1},2,3,4,5,6,7,8,9,10,11,12,13,14,15]
[null,"#","Country",{"$f":"TRANSPOSE(_xlfn._xlws.SORT(_xlfn.UNIQUE(t_data[Year])))","v":2010},2011,2012,2013,2014,2015,2016,2017,2018,2019,2020,2021,2022,2023,2024]
[null,{"$f":"_xlfn.SEQUENCE(COUNTA(_xlfn.ANCHORARRAY(C14)))","v":1},{"$f":"_xlfn._xlws.SORT(_xlfn.UNIQUE(t_data[Country]))","v":"Austria"},{"$f":"_xlfn.LET(_xlpm.ue_rate,\n_xlfn.XLOOKUP(_xlfn.ANCHORARRAY(C14)&_xlfn.ANCHORARRAY(D13)&myCurrentGender&myCurrentAgeClass,\nt_data[Country]&t_data[Year]&t_data[Gender]&t_data[Age_Class],\nt_data[Unemployment_Rate],\"\"),\nIF(_xlpm.ue_rate=0,\"\",_xlpm.ue_rate))","v":8.6999999999999994E-2},8.1000000000000003E-2,8.5999999999999993E-2,9.1999999999999998E-2,9.5000000000000001E-2,9.1999999999999998E-2,9.8000000000000004E-2,8.6999999999999994E-2,0.08,7.2999999999999995E-2,9.5000000000000001E-2,8.900000000000001E-2,7.4999999999999997E-2,8.199999999999999E-2,8.199999999999999E-2]
[null,2,"Belgium",0.16200000000000001,0.13699999999999998,0.14800000000000002,0.16699999999999998,0.16600000000000001,0.159,0.14499999999999999,0.13600000000000001,0.11,0.1,0.11,0.122,0.114,0.11599999999999999,0.124]
[null,3,"Bulgaria",0.183,0.20699999999999999,0.22399999999999998,0.23300000000000001,0.192,0.16,0.13900000000000001,0.11599999999999999,9.9000000000000005E-2,8.6999999999999994E-2,0.107,0.10400000000000001,7.9000000000000001E-2,0.08,7.6999999999999999E-2]
[null,4,"Croatia",0.23499999999999999,0.28300000000000003,0.318,0.34,0.32400000000000001,0.29799999999999999,0.24399999999999999,0.218,0.17499999999999999,0.13400000000000001,0.16200000000000001,0.16300000000000001,0.13500000000000001,0.13,0.11900000000000001]
[null,5,"Cyprus",0.11900000000000001,0.14800000000000002,0.20399999999999999,0.27500000000000002,0.26200000000000001,0.245,0.218,0.188,0.14699999999999999,0.121,0.13100000000000001,0.14000000000000001,0.13500000000000001,0.11800000000000001,0.1]
[null,6,"Czechia",0.13,0.11800000000000001,0.13100000000000001,0.12300000000000001,0.107,0.09,7.400000000000001E-2,5.0999999999999997E-2,4.4000000000000004E-2,3.7000000000000005E-2,5.2999999999999999E-2,5.2000000000000005E-2,4.2000000000000003E-2,5.2000000000000005E-2,5.9000000000000004E-2]
[null,7,"Denmark",0.14000000000000001,0.14499999999999999,0.14199999999999999,0.13100000000000001,0.125,0.109,0.111,0.113,9.9000000000000005E-2,9.6999999999999989E-2,0.11,9.5000000000000001E-2,8.5999999999999993E-2,0.10099999999999999,0.12]
[null,8,"Estonia",0.24399999999999999,0.17600000000000002,0.152,0.13699999999999998,0.115,9.5000000000000001E-2,0.10300000000000001,8.199999999999999E-2,7.4999999999999997E-2,7.5999999999999998E-2,0.127,0.109,0.109,0.11599999999999999,0.14300000000000002]
[null,9,"Finland",0.159,0.151,0.14599999999999999,0.154,0.16,0.17399999999999999,0.158,0.152,0.13100000000000001,0.125,0.151,0.13200000000000001,0.11199999999999999,0.127,0.14899999999999999]
[null,10,"France",0.17499999999999999,0.17399999999999999,0.183,0.191,0.18899999999999997,0.18899999999999997,0.184,0.16899999999999998,0.16399999999999998,0.152,0.156,0.14599999999999999,0.13699999999999998,0.13600000000000001,0.14400000000000002]
[null,11,"Germany",8.6999999999999994E-2,7.400000000000001E-2,7.8E-2,7.8E-2,7.400000000000001E-2,6.9000000000000006E-2,6.5000000000000002E-2,6.2E-2,5.7000000000000002E-2,5.2000000000000005E-2,6.7000000000000004E-2,0.06,0.05,0.05,5.5E-2]
[null,12,"Greece",0.247,0.35100000000000003,0.442,0.49099999999999999,0.45100000000000001,0.41299999999999998,0.38799999999999996,0.36099999999999999,0.33,0.29799999999999999,0.317,0.28399999999999997,0.24299999999999999,0.218,0.191]
[null,13,"Hungary",0.182,0.17100000000000001,0.18899999999999997,0.17300000000000001,0.13500000000000001,0.11800000000000001,8.8000000000000009E-2,7.0000000000000007E-2,6.4000000000000001E-2,7.0999999999999994E-2,8.4000000000000005E-2,8.199999999999999E-2,6.7000000000000004E-2,0.08,9.1999999999999998E-2]
[null,14,"Ireland",0.23,0.25,0.24399999999999999,0.214,0.19600000000000001,0.16600000000000001,0.13900000000000001,0.115,0.106,9.6000000000000002E-2,0.122,0.11199999999999999,8.3000000000000004E-2,8.5999999999999993E-2,8.5999999999999993E-2]
[null,15,"Italy",0.20600000000000002,0.20899999999999999,0.25800000000000001,0.30099999999999999,0.31900000000000001,0.3,0.28499999999999998,0.26700000000000002,0.248,0.22399999999999998,0.22500000000000001,0.223,0.18,0.16699999999999998,0.14699999999999999]
[null,16,"Latvia",0.28499999999999998,0.23199999999999998,0.20899999999999999,0.16500000000000001,0.14400000000000002,0.129,0.13400000000000001,0.11599999999999999,0.106,9.3000000000000013E-2,0.13200000000000001,0.11199999999999999,0.111,9.5000000000000001E-2,0.11199999999999999]
[null,17,"Lithuania",0.27200000000000002,0.23199999999999998,0.19600000000000001,0.17100000000000001,0.14699999999999999,0.127,0.10400000000000001,8.5999999999999993E-2,7.4999999999999997E-2,8.6999999999999994E-2,0.13400000000000001,0.1,8.3000000000000004E-2,9.8000000000000004E-2,0.115]
[null,18,"Luxembourg",8.199999999999999E-2,9.8000000000000004E-2,0.109,0.11,0.126,0.11900000000000001,0.106,9.4E-2,0.10099999999999999,0.10800000000000001,0.13300000000000001,9.9000000000000005E-2,0.09,0.10400000000000001,0.13]
[null,19,"Malta",0.1,9.8000000000000004E-2,9.8000000000000004E-2,9.1999999999999998E-2,8.8000000000000009E-2,8.5999999999999993E-2,7.400000000000001E-2,7.2999999999999995E-2,5.5999999999999994E-2,6.9000000000000006E-2,7.8E-2,7.0000000000000007E-2,6.7000000000000004E-2,6.4000000000000001E-2,0.06]
[null,20,"Netherlands",0.10199999999999999,9.5000000000000001E-2,0.109,0.12300000000000001,0.11800000000000001,0.106,0.1,8.5000000000000006E-2,7.0999999999999994E-2,7.0999999999999994E-2,8.900000000000001E-2,7.2999999999999995E-2,6.3E-2,6.7000000000000004E-2,7.0000000000000007E-2]
[null,21,"Poland",0.17300000000000001,0.17899999999999999,0.188,0.193,0.16899999999999998,0.14499999999999999,0.12,9.5000000000000001E-2,7.6999999999999999E-2,6.5000000000000002E-2,7.0999999999999994E-2,7.2999999999999995E-2,6.7000000000000004E-2,6.7000000000000004E-2,6.7000000000000004E-2]
[null,22,"Portugal",0.20100000000000001,0.22800000000000001,0.28499999999999998,0.29699999999999999,0.25800000000000001,0.23,0.21199999999999999,0.17,0.14199999999999999,0.127,0.159,0.156,0.13500000000000001,0.14199999999999999,0.14199999999999999]
[null,23,"Romania",0.184,0.18899999999999997,0.188,0.191,0.188,0.17199999999999999,0.155,0.14000000000000001,0.122,0.12300000000000001,0.13600000000000001,0.13100000000000001,0.14099999999999999,0.13,0.14099999999999999]
[null,24,"Slovakia",0.23199999999999998,0.23100000000000001,0.23899999999999999,0.24100000000000002,0.21100000000000002,0.17499999999999999,0.155,0.13300000000000001,0.109,9.6000000000000002E-2,0.12300000000000001,0.129,0.114,0.11599999999999999,0.11199999999999999]
[null,25,"Slovenia",0.13699999999999998,0.14800000000000002,0.17199999999999999,0.19,0.18899999999999997,0.16200000000000001,0.14699999999999999,0.10800000000000001,8.900000000000001E-2,7.4999999999999997E-2,9.6999999999999989E-2,9.6000000000000002E-2,8.199999999999999E-2,7.4999999999999997E-2,0.08]
[null,26,"Spain",0.317,0.34600000000000003,0.40299999999999997,0.42399999999999999,0.39700000000000002,0.36700000000000005,0.33299999999999996,0.29399999999999998,0.26200000000000001,0.247,0.29199999999999998,0.27200000000000002,0.223,0.214,0.20199999999999999]
[null,27,"Sweden",0.18600000000000003,0.16899999999999998,0.17600000000000002,0.17399999999999999,0.16800000000000001,0.151,0.13699999999999998,0.13,0.125,0.14000000000000001,0.17,0.17499999999999999,0.153,0.16,0.17300000000000001]
[]
[null,"Sorted Bar Chart by Country"]
[]
[]
[]
[null,"#","Country",{"$f":"myCurrentYear","v":2023},{"$f":"myCurrentYear","v":2023},null,"Sorted Countries","Sorted Values","Is Selected","Selected","Others","Average (unweigthed)"]
[null,{"$f":"_xlfn.ANCHORARRAY(B14)","v":1},{"$f":"_xlfn.ANCHORARRAY(C14)","v":"Austria"},{"$f":"INDEX(_xlfn.ANCHORARRAY(D14),_xlfn.ANCHORARRAY(B47),$D$8)","v":8.199999999999999E-2},{"$f":"IF(_xlfn.ANCHORARRAY(D47)=\"\",0,_xlfn.ANCHORARRAY(D47))","v":8.199999999999999E-2},null,{"$f":"_xlfn.SORTBY(_xlfn.ANCHORARRAY(C47),_xlfn.ANCHORARRAY(E47),-1)","v":"Greece"},{"$f":"_xlfn._xlws.SORT(_xlfn.ANCHORARRAY(E47),,-1)","v":0.218},{"$f":"--(_xlfn.ANCHORARRAY(G47)=myCurrentCountry)","v":0},{"$f":"_xlfn.ANCHORARRAY(I47)*_xlfn.ANCHORARRAY(H47)","v":0},{"$f":"(_xlfn.ANCHORARRAY(I47)=0)*_xlfn.ANCHORARRAY(H47)","v":0.218},{"$f":"AVERAGE(_xlfn.ANCHORARRAY(H47))","v":0.11077777777777779}]
[null,2,"Belgium",0.11599999999999999,0.11599999999999999,null,"Spain",0.214,0,0,0.214,{"$f":"L47","v":0.11077777777777779}]
[null,3,"Bulgaria",0.08,0.08,null,"Italy",0.16699999999999998,1,0.16699999999999998,0,{"$f":"L48","v":0.11077777777777779}]
[null,4,"Croatia",0.13,0.13,null,"Sweden",0.16,0,0,0.16,0.11077777777777779]
[null,5,"Cyprus",0.11800000000000001,0.11800000000000001,null,"Portugal",0.14199999999999999,0,0,0.14199999999999999,0.11077777777777779]
[null,6,"Czechia",5.2000000000000005E-2,5.2000000000000005E-2,null,"France",0.13600000000000001,0,0,0.13600000000000001,0.11077777777777779]
[null,7,"Denmark",0.10099999999999999,0.10099999999999999,null,"Croatia",0.13,0,0,0.13,0.11077777777777779]
[null,8,"Estonia",0.11599999999999999,0.11599999999999999,null,"Romania",0.13,0,0,0.13,0.11077777777777779]
[null,9,"Finland",0.127,0.127,null,"Finland",0.127,0,0,0.127,0.11077777777777779]
[null,10,"France",0.13600000000000001,0.13600000000000001,null,"Cyprus",0.11800000000000001,0,0,0.11800000000000001,0.11077777777777779]
[null,11,"Germany",0.05,0.05,null,"Belgium",0.11599999999999999,0,0,0.11599999999999999,0.11077777777777779]
[null,12,"Greece",0.218,0.218,null,"Estonia",0.11599999999999999,0,0,0.11599999999999999,0.11077777777777779]
[null,13,"Hungary",0.08,0.08,null,"Slovakia",0.11599999999999999,0,0,0.11599999999999999,0.11077777777777779]
[null,14,"Ireland",8.5999999999999993E-2,8.5999999999999993E-2,null,"Luxembourg",0.10400000000000001,0,0,0.10400000000000001,0.11077777777777779]
[null,15,"Italy",0.16699999999999998,0.16699999999999998,null,"Denmark",0.10099999999999999,0,0,0.10099999999999999,0.11077777777777779]
[null,16,"Latvia",9.5000000000000001E-2,9.5000000000000001E-2,null,"Lithuania",9.8000000000000004E-2,0,0,9.8000000000000004E-2,0.11077777777777779]
[null,17,"Lithuania",9.8000000000000004E-2,9.8000000000000004E-2,null,"Latvia",9.5000000000000001E-2,0,0,9.5000000000000001E-2,0.11077777777777779]
[null,18,"Luxembourg",0.10400000000000001,0.10400000000000001,null,"Ireland",8.5999999999999993E-2,0,0,8.5999999999999993E-2,0.11077777777777779]
[null,19,"Malta",6.4000000000000001E-2,6.4000000000000001E-2,null,"Austria",8.199999999999999E-2,0,0,8.199999999999999E-2,0.11077777777777779]
[null,20,"Netherlands",6.7000000000000004E-2,6.7000000000000004E-2,null,"Bulgaria",0.08,0,0,0.08,0.11077777777777779]
[null,21,"Poland",6.7000000000000004E-2,6.7000000000000004E-2,null,"Hungary",0.08,0,0,0.08,0.11077777777777779]
[null,22,"Portugal",0.14199999999999999,0.14199999999999999,null,"Slovenia",7.4999999999999997E-2,0,0,7.4999999999999997E-2,0.11077777777777779]
[null,23,"Romania",0.13,0.13,null,"Netherlands",6.7000000000000004E-2,0,0,6.7000000000000004E-2,0.11077777777777779]
[null,24,"Slovakia",0.11599999999999999,0.11599999999999999,null,"Poland",6.7000000000000004E-2,0,0,6.7000000000000004E-2,0.11077777777777779]
[null,25,"Slovenia",7.4999999999999997E-2,7.4999999999999997E-2,null,"Malta",6.4000000000000001E-2,0,0,6.4000000000000001E-2,0.11077777777777779]
[null,26,"Spain",0.214,0.214,null,"Czechia",5.2000000000000005E-2,0,0,5.2000000000000005E-2,0.11077777777777779]
[null,27,"Sweden",0.16,0.16,null,"Germany",0.05,0,0,0.05,0.11077777777777779]
[]
[null,"Dot Plot by Age Class"]
[]
[null,"#","Age Group","Min","Max","Average (unweighted)",{"$f":"myCurrentCountry","v":"Italy"},"Delta 1","Delta 2","Min Country","Max Country","MaxMin"]
[null,{"$f":"_xlfn.SEQUENCE(COUNTA(_xlfn.ANCHORARRAY(C78)),,7,-1)","v":7},{"$f":"_xlfn._xlws.SORT(_xlfn.UNIQUE(t_data[Age_Class]))","v":"15 to 24 years"},{"$f":"_xlfn.MINIFS(t_data[Unemployment_Rate],\nt_data[Year],myCurrentYear,\nt_data[Gender],myCurrentGender,\nt_data[Age_Class],_xlfn.ANCHORARRAY($C78))","v":5.9000000000000004E-2},{"$f":"_xlfn.MAXIFS(t_data[Unemployment_Rate],\nt_data[Year],myCurrentYear,\nt_data[Gender],myCurrentGender,\nt_data[Age_Class],_xlfn.ANCHORARRAY($C78))","v":0.28699999999999998},{"$f":"AVERAGEIFS(t_data[Unemployment_Rate],\nt_data[Year],myCurrentYear,\nt_data[Gender],myCurrentGender,\nt_data[Age_Class],_xlfn.ANCHORARRAY($C78))","v":0.1555185185185185},{"$f":"_xlfn.LET(_xlpm.ue_rate,\n_xlfn.XLOOKUP(myCurrentCountry&myCurrentYear&myCurrentGender&_xlfn.ANCHORARRAY(C78),\nt_data[Country]&t_data[Year]&t_data[Gender]&t_data[Age_Class],\nt_data[Unemployment_Rate],\"\"),\nIF(_xlpm.ue_rate=0,\"\",_xlpm.ue_rate))","v":0.22699999999999998},{"$f":"_xlfn.ANCHORARRAY(E78)-_xlfn.ANCHORARRAY(F78)","v":0.13148148148148148},{"$f":"_xlfn.ANCHORARRAY(F78)-_xlfn.ANCHORARRAY(D78)","v":9.6518518518518504E-2},{"$f":"_xlfn.LET(_xlpm.ue_rate,\n_xlfn.XLOOKUP(myCurrentYear&myCurrentGender&_xlfn.ANCHORARRAY($C78)&_xlfn.ANCHORARRAY(D78),\nt_data[Year]&t_data[Gender]&t_data[Age_Class]&t_data[Unemployment_Rate],\nt_data[Country],\"\"),\nIF(_xlpm.ue_rate=0,\"\",_xlpm.ue_rate))","v":"Germany"},{"$f":"_xlfn.LET(_xlpm.ue_rate,\n_xlfn.XLOOKUP(myCurrentYear&myCurrentGender&_xlfn.ANCHORARRAY($C78)&_xlfn.ANCHORARRAY(E78),\nt_data[Year]&t_data[Gender]&t_data[Age_Class]&t_data[Unemployment_Rate],\nt_data[Country],\"\"),\nIF(_xlpm.ue_rate=0,\"\",_xlpm.ue_rate))","v":"Spain"},{"$f":"MAX(_xlfn.ANCHORARRAY(E78))","v":0.28699999999999998}]
[null,6,"15 to 29 years",0.05,0.218,0.11077777777777781,0.16699999999999998,0.10722222222222219,6.0777777777777806E-2,"Germany","Greece",{"$f":"MIN(_xlfn.ANCHORARRAY(D78))","v":1.7000000000000001E-2}]
[null,5,"15 to 74 years",2.6000000000000002E-2,0.122,5.7666666666666665E-2,7.6999999999999999E-2,6.4333333333333326E-2,3.1666666666666662E-2,"Czechia","Spain",{"$f":"L79","v":1.7000000000000001E-2}]
[null,4,"20 to 64 years",2.5000000000000001E-2,0.11900000000000001,5.5111111111111118E-2,7.5999999999999998E-2,6.3888888888888884E-2,3.0111111111111116E-2,"Czechia","Spain",{"$f":"L80","v":1.7000000000000001E-2}]
[null,3,"25 to 54 years",2.3E-2,0.11,5.0999999999999997E-2,7.4999999999999997E-2,5.9000000000000004E-2,2.7999999999999997E-2,"Czechia","Greece",1.7000000000000001E-2]
[null,2,"25 to 74 years",2.2000000000000002E-2,0.109,4.9185185185185186E-2,6.7000000000000004E-2,5.9814814814814814E-2,2.7185185185185184E-2,"Czechia","Spain",1.7000000000000001E-2]
[null,1,"55 to 74 years",1.7000000000000001E-2,0.111,4.3760000000000014E-2,4.4000000000000004E-2,6.7239999999999994E-2,2.6760000000000013E-2,"Poland","Spain",1.7000000000000001E-2]
[]
[null,"Band Chart"]
[]
[null,null,null,{"$f":"_xlfn.ANCHORARRAY($D$13)","v":2010},2011,2012,2013,2014,2015,2016,2017,2018,2019,2020,2021,2022,2023,2024]
[null,null,{"$f":"myCurrentCountry","v":"Italy"},{"$f":"_xlfn.LET(_xlpm.ue_rate_selected,INDEX(_xlfn.ANCHORARRAY(D$14),$D$6,_xlfn.ANCHORARRAY(D12)),IF(_xlpm.ue_rate_selected=\"\",NA(),_xlpm.ue_rate_selected))","v":0.20600000000000002},0.20899999999999999,0.25800000000000001,0.30099999999999999,0.31900000000000001,0.3,0.28499999999999998,0.26700000000000002,0.248,0.22399999999999998,0.22500000000000001,0.223,0.18,0.16699999999999998,0.14699999999999999]
[null,null,"Min",{"$f":"_xlfn.BYCOL(_xlfn.ANCHORARRAY(D14),_xlfn.LAMBDA(_xlpm.column,MIN(_xlpm.column)))","v":8.199999999999999E-2},7.400000000000001E-2,7.8E-2,7.8E-2,7.400000000000001E-2,6.9000000000000006E-2,6.5000000000000002E-2,5.0999999999999997E-2,4.4000000000000004E-2,3.7000000000000005E-2,5.2999999999999999E-2,5.2000000000000005E-2,4.2000000000000003E-2,0.05,5.5E-2]
[null,null,"Max",{"$f":"_xlfn.BYCOL(_xlfn.ANCHORARRAY(D14),_xlfn.LAMBDA(_xlpm.column,MAX(_xlpm.column)))","v":0.317},0.35100000000000003,0.442,0.49099999999999999,0.45100000000000001,0.41299999999999998,0.38799999999999996,0.36099999999999999,0.33,0.29799999999999999,0.317,0.28399999999999997,0.24299999999999999,0.218,0.20199999999999999]
[null,null,"Average (unweighted)",{"$f":"_xlfn.BYCOL(_xlfn.ANCHORARRAY(D14),_xlfn.LAMBDA(_xlpm.column,AVERAGE(_xlpm.column)))","v":0.17988888888888888},0.18222222222222217,0.19692592592592589,0.20262962962962966,0.18937037037037041,0.17207407407407407,0.15614814814814812,0.13744444444444445,0.12088888888888889,0.11274074074074078,0.13448148148148148,0.12588888888888888,0.11022222222222221,0.11077777777777781,0.11451851851851853]
[null,null,"Range",{"$f":"_xlfn.ANCHORARRAY(D91)-_xlfn.ANCHORARRAY(D90)","v":0.23500000000000001},0.27700000000000002,0.36399999999999999,0.41299999999999998,0.377,0.34399999999999997,0.32299999999999995,0.31,0.28600000000000003,0.26100000000000001,0.26400000000000001,0.23199999999999998,0.20099999999999998,0.16799999999999998,0.14699999999999999]
[null,null,"Selected Year",{"$f":"IF(_xlfn.ANCHORARRAY(D88)=myCurrentYear,$D$95,NA())","v":{"$error":"#N/A"}},{"$error":"#N/A"},{"$error":"#N/A"},{"$error":"#N/A"},{"$error":"#N/A"},{"$error":"#N/A"},{"$error":"#N/A"},{"$error":"#N/A"},{"$error":"#N/A"},{"$error":"#N/A"},{"$error":"#N/A"},{"$error":"#N/A"},{"$error":"#N/A"},0.49099999999999999,{"$error":"#N/A"}]
[null,null,"Max all Years",{"$f":"MAX(_xlfn.ANCHORARRAY(D91))","v":0.49099999999999999}]
[]
[null,"Line Chart"]
[]
[null,null,null,{"$f":"_xlfn.ANCHORARRAY($D$13)","v":2010},2011,2012,2013,2014,2015,2016,2017,2018,2019,2020,2021,2022,2023,2024]
[null,null,{"$f":"_xlfn.ANCHORARRAY(C14)","v":"Austria"},{"$f":"IF(_xlfn.ANCHORARRAY($D$14)=\"\",NA(),_xlfn.ANCHORARRAY($D$14))","v":8.6999999999999994E-2},8.1000000000000003E-2,8.5999999999999993E-2,9.1999999999999998E-2,9.5000000000000001E-2,9.1999999999999998E-2,9.8000000000000004E-2,8.6999999999999994E-2,0.08,7.2999999999999995E-2,9.5000000000000001E-2,8.900000000000001E-2,7.4999999999999997E-2,8.199999999999999E-2,8.199999999999999E-2]
[null,null,"Belgium",0.16200000000000001,0.13699999999999998,0.14800000000000002,0.16699999999999998,0.16600000000000001,0.159,0.14499999999999999,0.13600000000000001,0.11,0.1,0.11,0.122,0.114,0.11599999999999999,0.124]
[null,null,"Bulgaria",0.183,0.20699999999999999,0.22399999999999998,0.23300000000000001,0.192,0.16,0.13900000000000001,0.11599999999999999,9.9000000000000005E-2,8.6999999999999994E-2,0.107,0.10400000000000001,7.9000000000000001E-2,0.08,7.6999999999999999E-2]
[null,null,"Croatia",0.23499999999999999,0.28300000000000003,0.318,0.34,0.32400000000000001,0.29799999999999999,0.24399999999999999,0.218,0.17499999999999999,0.13400000000000001,0.16200000000000001,0.16300000000000001,0.13500000000000001,0.13,0.11900000000000001]
[null,null,"Cyprus",0.11900000000000001,0.14800000000000002,0.20399999999999999,0.27500000000000002,0.26200000000000001,0.245,0.218,0.188,0.14699999999999999,0.121,0.13100000000000001,0.14000000000000001,0.13500000000000001,0.11800000000000001,0.1]
[null,null,"Czechia",0.13,0.11800000000000001,0.13100000000000001,0.12300000000000001,0.107,0.09,7.400000000000001E-2,5.0999999999999997E-2,4.4000000000000004E-2,3.7000000000000005E-2,5.2999999999999999E-2,5.2000000000000005E-2,4.2000000000000003E-2,5.2000000000000005E-2,5.9000000000000004E-2]
[null,null,"Denmark",0.14000000000000001,0.14499999999999999,0.14199999999999999,0.13100000000000001,0.125,0.109,0.111,0.113,9.9000000000000005E-2,9.6999999999999989E-2,0.11,9.5000000000000001E-2,8.5999999999999993E-2,0.10099999999999999,0.12]
[null,null,"Estonia",0.24399999999999999,0.17600000000000002,0.152,0.13699999999999998,0.115,9.5000000000000001E-2,0.10300000000000001,8.199999999999999E-2,7.4999999999999997E-2,7.5999999999999998E-2,0.127,0.109,0.109,0.11599999999999999,0.14300000000000002]
[null,null,"Finland",0.159,0.151,0.14599999999999999,0.154,0.16,0.17399999999999999,0.158,0.152,0.13100000000000001,0.125,0.151,0.13200000000000001,0.11199999999999999,0.127,0.14899999999999999]
[null,null,"France",0.17499999999999999,0.17399999999999999,0.183,0.191,0.18899999999999997,0.18899999999999997,0.184,0.16899999999999998,0.16399999999999998,0.152,0.156,0.14599999999999999,0.13699999999999998,0.13600000000000001,0.14400000000000002]
[null,null,"Germany",8.6999999999999994E-2,7.400000000000001E-2,7.8E-2,7.8E-2,7.400000000000001E-2,6.9000000000000006E-2,6.5000000000000002E-2,6.2E-2,5.7000000000000002E-2,5.2000000000000005E-2,6.7000000000000004E-2,0.06,0.05,0.05,5.5E-2]
[null,null,"Greece",0.247,0.35100000000000003,0.442,0.49099999999999999,0.45100000000000001,0.41299999999999998,0.38799999999999996,0.36099999999999999,0.33,0.29799999999999999,0.317,0.28399999999999997,0.24299999999999999,0.218,0.191]
[null,null,"Hungary",0.182,0.17100000000000001,0.18899999999999997,0.17300000000000001,0.13500000000000001,0.11800000000000001,8.8000000000000009E-2,7.0000000000000007E-2,6.4000000000000001E-2,7.0999999999999994E-2,8.4000000000000005E-2,8.199999999999999E-2,6.7000000000000004E-2,0.08,9.1999999999999998E-2]
[null,null,"Ireland",0.23,0.25,0.24399999999999999,0.214,0.19600000000000001,0.16600000000000001,0.13900000000000001,0.115,0.106,9.6000000000000002E-2,0.122,0.11199999999999999,8.3000000000000004E-2,8.5999999999999993E-2,8.5999999999999993E-2]
[null,null,"Italy",0.20600000000000002,0.20899999999999999,0.25800000000000001,0.30099999999999999,0.31900000000000001,0.3,0.28499999999999998,0.26700000000000002,0.248,0.22399999999999998,0.22500000000000001,0.223,0.18,0.16699999999999998,0.14699999999999999]
[null,null,"Latvia",0.28499999999999998,0.23199999999999998,0.20899999999999999,0.16500000000000001,0.14400000000000002,0.129,0.13400000000000001,0.11599999999999999,0.106,9.3000000000000013E-2,0.13200000000000001,0.11199999999999999,0.111,9.5000000000000001E-2,0.11199999999999999]
[null,null,"Lithuania",0.27200000000000002,0.23199999999999998,0.19600000000000001,0.17100000000000001,0.14699999999999999,0.127,0.10400000000000001,8.5999999999999993E-2,7.4999999999999997E-2,8.6999999999999994E-2,0.13400000000000001,0.1,8.3000000000000004E-2,9.8000000000000004E-2,0.115]
[null,null,"Luxembourg",8.199999999999999E-2,9.8000000000000004E-2,0.109,0.11,0.126,0.11900000000000001,0.106,9.4E-2,0.10099999999999999,0.10800000000000001,0.13300000000000001,9.9000000000000005E-2,0.09,0.10400000000000001,0.13]
[null,null,"Malta",0.1,9.8000000000000004E-2,9.8000000000000004E-2,9.1999999999999998E-2,8.8000000000000009E-2,8.5999999999999993E-2,7.400000000000001E-2,7.2999999999999995E-2,5.5999999999999994E-2,6.9000000000000006E-2,7.8E-2,7.0000000000000007E-2,6.7000000000000004E-2,6.4000000000000001E-2,0.06]
[null,null,"Netherlands",0.10199999999999999,9.5000000000000001E-2,0.109,0.12300000000000001,0.11800000000000001,0.106,0.1,8.5000000000000006E-2,7.0999999999999994E-2,7.0999999999999994E-2,8.900000000000001E-2,7.2999999999999995E-2,6.3E-2,6.7000000000000004E-2,7.0000000000000007E-2]
[null,null,"Poland",0.17300000000000001,0.17899999999999999,0.188,0.193,0.16899999999999998,0.14499999999999999,0.12,9.5000000000000001E-2,7.6999999999999999E-2,6.5000000000000002E-2,7.0999999999999994E-2,7.2999999999999995E-2,6.7000000000000004E-2,6.7000000000000004E-2,6.7000000000000004E-2]
[null,null,"Portugal",0.20100000000000001,0.22800000000000001,0.28499999999999998,0.29699999999999999,0.25800000000000001,0.23,0.21199999999999999,0.17,0.14199999999999999,0.127,0.159,0.156,0.13500000000000001,0.14199999999999999,0.14199999999999999]
[null,null,"Romania",0.184,0.18899999999999997,0.188,0.191,0.188,0.17199999999999999,0.155,0.14000000000000001,0.122,0.12300000000000001,0.13600000000000001,0.13100000000000001,0.14099999999999999,0.13,0.14099999999999999]
[null,null,"Slovakia",0.23199999999999998,0.23100000000000001,0.23899999999999999,0.24100000000000002,0.21100000000000002,0.17499999999999999,0.155,0.13300000000000001,0.109,9.6000000000000002E-2,0.12300000000000001,0.129,0.114,0.11599999999999999,0.11199999999999999]
[null,null,"Slovenia",0.13699999999999998,0.14800000000000002,0.17199999999999999,0.19,0.18899999999999997,0.16200000000000001,0.14699999999999999,0.10800000000000001,8.900000000000001E-2,7.4999999999999997E-2,9.6999999999999989E-2,9.6000000000000002E-2,8.199999999999999E-2,7.4999999999999997E-2,0.08]
[null,null,"Spain",0.317,0.34600000000000003,0.40299999999999997,0.42399999999999999,0.39700000000000002,0.36700000000000005,0.33299999999999996,0.29399999999999998,0.26200000000000001,0.247,0.29199999999999998,0.27200000000000002,0.223,0.214,0.20199999999999999]
[null,null,"Sweden",0.18600000000000003,0.16899999999999998,0.17600000000000002,0.17399999999999999,0.16800000000000001,0.151,0.13699999999999998,0.13,0.125,0.14000000000000001,0.17,0.17499999999999999,0.153,0.16,0.17300000000000001]
[]
[]
[null,null,"Average (unweighted)",{"$f":"_xlfn.BYCOL(_xlfn.ANCHORARRAY(D14),_xlfn.LAMBDA(_xlpm.column,AVERAGE(_xlpm.column)))","v":0.17988888888888888},0.18222222222222217,0.19692592592592589,0.20262962962962966,0.18937037037037041,0.17207407407407407,0.15614814814814812,0.13744444444444445,0.12088888888888889,0.11274074074074078,0.13448148148148148,0.12588888888888888,0.11022222222222221,0.11077777777777781,0.11451851851851853]
[null,null,{"$f":"myCurrentCountry","v":"Italy"},{"$f":"_xlfn.CHOOSEROWS(_xlfn.ANCHORARRAY(D100),$D$6)","v":0.20600000000000002},0.20899999999999999,0.25800000000000001,0.30099999999999999,0.31900000000000001,0.3,0.28499999999999998,0.26700000000000002,0.248,0.22399999999999998,0.22500000000000001,0.223,0.18,0.16699999999999998,0.14699999999999999]
[]
[null,"Scrollable Table"]
[]
[null,null,null,{"$f":"_xlfn.SEQUENCE(1,10,control!$C$80+1)","v":6},7,8,9,10,11,12,13,14,15]
[null,"#","Country",{"$f":"INDEX(_xlfn.ANCHORARRAY(D13),,_xlfn.ANCHORARRAY(D134))","v":2015},2016,2017,2018,2019,2020,2021,2022,2023,2024,null,"Pos"]
[null,{"$f":"_xlfn.SEQUENCE(10,1,control!$C$81+1)","v":11},{"$f":"INDEX(_xlfn.ANCHORARRAY(C14),_xlfn.ANCHORARRAY($B136))","v":"Germany"},{"$f":"INDEX(_xlfn.ANCHORARRAY(D14),_xlfn.ANCHORARRAY(B136),_xlfn.ANCHORARRAY(D134))","v":6.9000000000000006E-2},6.5000000000000002E-2,6.2E-2,5.7000000000000002E-2,5.2000000000000005E-2,6.7000000000000004E-2,0.06,0.05,0.05,5.5E-2,null,{"$f":"MATCH(_xlfn.ANCHORARRAY(C136),_xlfn.ANCHORARRAY(C14),0)","v":11}]
[null,12,"Greece",0.41299999999999998,0.38799999999999996,0.36099999999999999,0.33,0.29799999999999999,0.317,0.28399999999999997,0.24299999999999999,0.218,0.191,null,12]
[null,13,"Hungary",0.11800000000000001,8.8000000000000009E-2,7.0000000000000007E-2,6.4000000000000001E-2,7.0999999999999994E-2,8.4000000000000005E-2,8.199999999999999E-2,6.7000000000000004E-2,0.08,9.1999999999999998E-2,null,13]
[null,14,"Ireland",0.16600000000000001,0.13900000000000001,0.115,0.106,9.6000000000000002E-2,0.122,0.11199999999999999,8.3000000000000004E-2,8.5999999999999993E-2,8.5999999999999993E-2,null,14]
[null,15,"Italy",0.3,0.28499999999999998,0.26700000000000002,0.248,0.22399999999999998,0.22500000000000001,0.223,0.18,0.16699999999999998,0.14699999999999999,null,15]
[null,16,"Latvia",0.129,0.13400000000000001,0.11599999999999999,0.106,9.3000000000000013E-2,0.13200000000000001,0.11199999999999999,0.111,9.5000000000000001E-2,0.11199999999999999,null,16]
[null,17,"Lithuania",0.127,0.10400000000000001,8.5999999999999993E-2,7.4999999999999997E-2,8.6999999999999994E-2,0.13400000000000001,0.1,8.3000000000000004E-2,9.8000000000000004E-2,0.115,null,17]
[null,18,"Luxembourg",0.11900000000000001,0.106,9.4E-2,0.10099999999999999,0.10800000000000001,0.13300000000000001,9.9000000000000005E-2,0.09,0.10400000000000001,0.13,null,18]
[null,19,"Malta",8.5999999999999993E-2,7.400000000000001E-2,7.2999999999999995E-2,5.5999999999999994E-2,6.9000000000000006E-2,7.8E-2,7.0000000000000007E-2,6.7000000000000004E-2,6.4000000000000001E-2,0.06,null,19]
[null,20,"Netherlands",0.106,0.1,8.5000000000000006E-2,7.0999999999999994E-2,7.0999999999999994E-2,8.900000000000001E-2,7.2999999999999995E-2,6.3E-2,6.7000000000000004E-2,7.0000000000000007E-2,null,20]
[]
[null,"Choropleth Map"]
[]
[null,"#","Country Name","Value","Shape Name","Shape Index"]
[null,{"$f":"_xlfn.ANCHORARRAY(B47)","v":1},{"$f":"_xlfn.ANCHORARRAY(C14)","v":"Austria"},{"$f":"_xlfn.LET(_xlpm.ue_rate,INDEX(_xlfn.ANCHORARRAY(D14),_xlfn.ANCHORARRAY(B150),$D$8),IF(_xlpm.ue_rate=\"\",\"\",_xlpm.ue_rate))","v":8.199999999999999E-2},"S_AUT",1]
[null,2,"Belgium",0.11599999999999999,"S_BEL",2]
[null,3,"Bulgaria",0.08,"S_BGR",3]
[null,4,"Croatia",0.13,"S_HRV",4]
[null,5,"Cyprus",0.11800000000000001,"S_CYP",5]
[null,6,"Czechia",5.2000000000000005E-2,"S_CZE",6]
[null,7,"Denmark",0.10099999999999999,"S_DNK",7]
[null,8,"Estonia",0.11599999999999999,"S_EST",8]
[null,9,"Finland",0.127,"S_FIN",9]
[null,10,"France",0.13600000000000001,"S_FRA",10]
[null,11,"Germany",0.05,"S_DEU",11]
[null,12,"Greece",0.218,"S_GRC",12]
[null,13,"Hungary",0.08,"S_HUN",13]
[null,14,"Ireland",8.5999999999999993E-2,"S_IRL",14]
[null,15,"Italy",0.16699999999999998,"S_ITA",15]
[null,16,"Latvia",9.5000000000000001E-2,"S_LVA",16]
[null,17,"Lithuania",9.8000000000000004E-2,"S_LTU",17]
[null,18,"Luxembourg",0.10400000000000001,"S_LUX",18]
[null,19,"Malta",6.4000000000000001E-2,"S_MLT",19]
[null,20,"Netherlands",6.7000000000000004E-2,"S_NLD",20]
[null,21,"Poland",6.7000000000000004E-2,"S_POL",21]
[null,22,"Portugal",0.14199999999999999,"S_PRT",22]
[null,23,"Romania",0.13,"S_ROU",23]
[null,24,"Slovakia",0.11599999999999999,"S_SVK",24]
[null,25,"Slovenia",7.4999999999999997E-2,"S_SVN",25]
[null,26,"Spain",0.214,"S_ESP",26]
[null,27,"Sweden",0.16,"S_SWE",27]
[]
[null,"Map legend calculations"]
[]
[null,null,"Maximum value",{"$f":"MAX(_xlfn.ANCHORARRAY(E47))","v":0.218}]
[null,null,"Step Size",0.02]
[null,null,"Current country bin",{"$f":"IFERROR(VLOOKUP(INDEX($D$47:$D$73,$D$6,1),$E$184:$G$193,3,TRUE),control!$E$91)","v":"16% to 18%"}]
[]
[null,null,null,{"$f":"_xlfn.SEQUENCE(10)","v":1},0,{"$f":"$D$181","v":0.02},{"$f":"TEXT(E184,\"0%\")&\" to \"&TEXT(F184,\"0%\")","v":"0% to 2%"}]
[null,null,null,2,{"$f":"F184","v":0.02},{"$f":"F184+$D$181","v":0.04},{"$f":"TEXT(E185,\"0%\")&\" to \"&TEXT(F185,\"0%\")","v":"2% to 4%"}]
[null,null,null,3,{"$f":"F185","v":0.04},0.06,"4% to 6%"]
[null,null,null,4,0.06,0.08,"6% to 8%"]
[null,null,null,5,0.08,0.1,"8% to 10%"]
[null,null,null,6,0.1,0.12000000000000001,"10% to 12%"]
[null,null,null,7,0.12000000000000001,0.14000000000000001,"12% to 14%"]
[null,null,null,8,0.14000000000000001,0.16,"14% to 16%"]
[null,null,null,9,0.16,0.18,"16% to 18%"]
[null,null,null,10,0.18,1,{"$f":"TEXT(E193,\"0%\")&\" or more\"","v":"18% or more"}]
[]
[null,"Last row",null,null,null,null,null,null,null,null,null,null,null,null,null,null,null,"End of worksheet"]

{"sheet":"charts","index":4,"n_rows":44,"n_cols":9,"rows_kept":44,"cut":false,"hidden":false,"merged":[]}
[]
[null,"Line and Band Chart"]
[]
[]
[]
[]
[]
[]
[]
[]
[]
[]
[]
[]
[]
[]
[]
[]
[]
[]
[]
[]
[]
[]
[]
[]
[]
[]
[]
[]
[]
[]
[]
[]
[]
[]
[]
[]
[]
[]
[]
[]
[]
[null,"Last row",null,null,null,null,null,null,"End of worksheet"]

{"sheet":"map icon","index":5,"n_rows":6,"n_cols":2,"rows_kept":6,"cut":false,"hidden":false,"merged":[]}
[]
[null,"Map \"Icon\""]
[]
[]
[]
[null,"End of worksheet"]