{"text_format":"1","workbook":"xlsx","n_sheets":3,"sheets":["Dashboard","Data","Calculations"],"not_rendered":{"charts":3,"images":4,"macros":1,"external_links":0,"defined_names":11,"comments":0,"pivot_tables":0},"unopened":[],"bounds":{"document_bytes":16777216,"sheet_cells":100000,"rows_first":2000,"rows_last":500,"rows_between":2000,"halvings":0,"cell_chars":16384,"cell_head_chars":4096},"cells_cut":0,"cells_raw":0,"read":"whole","date_system":"1900"}

{"sheet":"Dashboard","index":0,"n_rows":29,"n_cols":11,"rows_kept":29,"cut":false,"hidden":false,"merged":[]}
[]
[null,"50 Most Prominent Summits on Earth - Bluffing Tableau Actions and Tooltips with Microsoft Excel (camera version)",null,null,null,null,null,null,null,"www.clearlyandsimply.com"]
[]
[]
[]
[]
[]
[]
[]
[]
[]
[]
[]
[]
[]
[]
[]
[]
[null,"No.",{"$f":"Data!B4","v":"Summit Name"},{"$f":"Data!C4","v":"Country"},{"$f":"Data!H4","v":"First Ascent by"},{"$f":"Data!I4","v":"Year"},{"$f":"Data!F4","v":"Elevation in m"},null,{"$f":"Data!G4","v":"Prominence in m"}]
[null,{"$f":"Calculations!E70","v":27},{"$f":"Calculations!G70","v":"Yu Shan"},{"$f":"Calculations!H70","v":"Taiwan"},{"$f":"Calculations!K70","v":"K. Stopel"},{"$f":"Calculations!L70","v":"1898"},{"$f":"Calculations!I70","v":3952},null,{"$f":"Calculations!J70","v":3952},null,{"$f":"Calculations!$F70","v":27}]
[null,{"$f":"Calculations!E71","v":28},{"$f":"Calculations!G71","v":"Ngaliema (Mt. Stanley)"},{"$f":"Calculations!H71","v":"Congo/Uganda"},{"$f":"Calculations!K71","v":"Duke of the Abruzzi et al."},{"$f":"Calculations!L71","v":"1906"},{"$f":"Calculations!I71","v":5109},null,{"$f":"Calculations!J71","v":3951},null,{"$f":"Calculations!$F71","v":28}]
[null,{"$f":"Calculations!E72","v":29},{"$f":"Calculations!G72","v":"Kangchenjunga"},{"$f":"Calculations!H72","v":"India/Nepal"},{"$f":"Calculations!K72","v":"George Band, Joe Brown"},{"$f":"Calculations!L72","v":"1955"},{"$f":"Calculations!I72","v":8586},null,{"$f":"Calculations!J72","v":3922},null,{"$f":"Calculations!$F72","v":29}]
[null,{"$f":"Calculations!E73","v":30},{"$f":"Calculations!G73","v":"Tirich Mir"},{"$f":"Calculations!H73","v":"Pakistan"},{"$f":"Calculations!K73","v":"Arne Næss, P. Kvernberg, H. Berg, Tony Streather"},{"$f":"Calculations!L73","v":"1950"},{"$f":"Calculations!I73","v":7708},null,{"$f":"Calculations!J73","v":3910},null,{"$f":"Calculations!$F73","v":30}]
[null,{"$f":"Calculations!E74","v":31},{"$f":"Calculations!G74","v":"Mt. Cameroon"},{"$f":"Calculations!H74","v":"Cameroon"},{"$f":"Calculations!K74","v":"Richard Francis Burton, Gustav Mann"},{"$f":"Calculations!L74","v":"1861"},{"$f":"Calculations!I74","v":4040},null,{"$f":"Calculations!J74","v":3901},null,{"$f":"Calculations!$F74","v":31}]
[null,{"$f":"Calculations!E75","v":32},{"$f":"Calculations!G75","v":"Mt. Kenya"},{"$f":"Calculations!H75","v":"Kenya"},{"$f":"Calculations!K75","v":"Halford Mackinder, Cesar Ollier, Joseph Brocherel"},{"$f":"Calculations!L75","v":"1899"},{"$f":"Calculations!I75","v":5199},null,{"$f":"Calculations!J75","v":3825},null,{"$f":"Calculations!$F75","v":32}]
[null,{"$f":"Calculations!E76","v":33},{"$f":"Calculations!G76","v":"Gunung Kerinci"},{"$f":"Calculations!H76","v":"Indonesia"},{"$f":"Calculations!K76","v":"Hasselt, Veth"},{"$f":"Calculations!L76","v":"1877"},{"$f":"Calculations!I76","v":3805},null,{"$f":"Calculations!J76","v":3805},null,{"$f":"Calculations!$F76","v":33}]
[null,{"$f":"Calculations!E77","v":34},{"$f":"Calculations!G77","v":"Mt. Erebus"},{"$f":"Calculations!H77","v":"Antarctica"},{"$f":"Calculations!K77","v":"Tannatt David,Douglas Mawson"},{"$f":"Calculations!L77","v":"1908"},{"$f":"Calculations!I77","v":3794},null,{"$f":"Calculations!J77","v":3794},null,{"$f":"Calculations!$F77","v":34}]
[null,{"$f":"Calculations!E78","v":35},{"$f":"Calculations!G78","v":"Fuji San"},{"$f":"Calculations!H78","v":"Japan"},{"$f":"Calculations!K78","v":"Unknown monk"},{"$f":"Calculations!L78","v":"663"},{"$f":"Calculations!I78","v":3776},null,{"$f":"Calculations!J78","v":3776},null,{"$f":"Calculations!$F78","v":35}]
[null,{"$f":"Calculations!E79","v":36},{"$f":"Calculations!G79","v":"Jebel Toubkal"},{"$f":"Calculations!H79","v":"Morocco"},{"$f":"Calculations!K79","v":"Marquis de Segonzac, V. Berger, H. Dolbeau"},{"$f":"Calculations!L79","v":"1923"},{"$f":"Calculations!I79","v":4167},null,{"$f":"Calculations!J79","v":3755},null,{"$f":"Calculations!$F79","v":37}]

{"sheet":"Data","index":1,"n_rows":54,"n_cols":10,"rows_kept":54,"cut":false,"hidden":false,"merged":[]}
[]
[null,"Data - 50 selected summits"]
[]
[null,"Summit Name","Country","Latitude","Longitude","Elevation in m","Prominence in m","First Ascent by","Year","Aerial link"]
[null,"Mt. Everest","Nepal/Tibet",27.986519000000001,86.919708,8848,8848,"Edmund Hillary, Tenzing Norgay","1953","http://maps.google.com/maps?ll=27.986519,86.919708&spn=.429142,.595562&t=k&hl=en&output=embed"]
[null,"Aconcagua","Argentina",-32.656286000000001,-70.015782999999999,6962,6962,"Matthias Zurbriggen","1897","http://maps.google.com/maps?ll=-32.656286,-70.015783&spn=.204576,.297781&t=k&hl=en&output=embed"]
[null,"Mt. McKinley (Denali)","US",63.098486999999999,-151.001587,6194,6138,"Hudson Stuck","1913","http://maps.google.com/maps?ll=63.098487,-151.001587&spn=.219883,.595562&t=k&hl=en&output=embed"]
[null,"Kilimanjaro","Tanzania",-3.0582389999999999,37.346648999999999,5895,5885,"Hans Meyer, Ludwig Purtscheller, Yohani Kinyala Lauwo","1889","http://maps.google.com/maps?ll=-3.058239,37.346649&spn=.121320,.148890&t=k&hl=en&output=embed"]
[null,"Cristobal Colon","Colombia",10.829765,-73.701096000000007,5700,5509,"-","-","http://maps.google.com/maps?ll=10.829765,-73.701096&spn=.238659,.297781&t=k&hl=en&output=embed"]
[null,"Mt. Logan","Canada",60.633468999999998,-140.439606,5959,5250,"Albert H. MacCarthy, W. W. Foster","1925","http://maps.google.com/maps?ll=60.633469,-140.439606&spn=.119159,.297781&t=k&hl=en&output=embed"]
[null,"Pico de Orizaba (Citlaltepetl)","Mexico",19.03,-97.266599999999997,5636,4922,"F. Maynard, G. Reynolds","1848","http://maps.google.com/maps?ll=19.030000,-97.266600&spn=.229706,.297781&t=k&hl=en&output=embed"]
[null,"Vinson Massif","Antarctica",-78.510000000000005,-85.6,4892,4892,"Nicholas Clinch","1966","http://maps.google.com/maps?ll=-78.510000,-85.600000&spn=6.274193,38.115967&t=k&hl=en&output=embed"]
[null,"Puncak Jaya","Indonesia",-4.0666000000000002,137.18333000000001,4884,4884,"Heinrich Harrer et al.","1962","http://maps.google.com/maps?ll=-4.066600,137.183330&spn=.242375,.297781&t=k&hl=en&output=embed"]
[null,"Gora Elbrus","Russia",43.35,42.433300000000003,5642,4741,"Florence Crauford Grove, Frederick Gardner, Horace Walker, Peter Knubel","1874","http://maps.google.com/maps?ll=43.350000,42.433300&spn=.353386,.595562&t=k&hl=en&output=embed"]
[null,"Mont Blanc","France/Italy",45.832999999999998,6.8659999999999997,4809,4696,"Jacques Balmat, Michel-Gabriel Paccard","1786 ","http://maps.google.com/maps?ll=45.833000,6.866000&spn=.169301,.297781&t=k&hl=en&output=embed"]
[null,"Damavand","Iran",35.954386999999997,52.111243999999999,5610,4667,"Abu Dolaf Kazraji","905","http://maps.google.com/maps?ll=35.954387,52.111244&spn=.196694,.297781&t=k&hl=en&output=embed"]
[null,"Klyuchevskaya Volcano","Russia",56.060153,160.63179,4750,4649,"Daniel Gauss et al.","1788","http://maps.google.com/maps?ll=56.060153,160.631790&spn=.271330,.595562&t=k&hl=en&output=embed"]
[null,"Nanga Parbat","Pakistan",35.2333,74.599999999999994,8125,4608,"Hermann Buhl","1953","http://maps.google.com/maps?ll=35.233300,74.600000&spn=.396945,.595562&t=k&hl=en&output=embed"]
[null,"Mauna Kea","US",19.824204000000002,-155.46752900000001,4205,4205,"-","-","http://maps.google.com/maps?ll=19.824204,-155.467529&spn=.228587,.297781&t=k&hl=en&output=embed"]
[null,"Jengish Chokusu (ex. Pik Pobedy)","Kyrgyzstan/China",42.033299999999997,80.116665999999995,7439,4148,"Witali Abalakow et al.","1956","http://maps.google.com/maps?ll=42.033300,80.116666&spn=.360958,.595562&t=k&hl=en&output=embed"]
[null,"Chimborazo","Ecuador",-1.467544,-78.816090000000003,6267,4122,"Edward Whymper","1880","http://maps.google.com/maps?ll=-1.467544,-78.816090&spn=.242907,.297781&t=k&hl=en&output=embed"]
[null,"Bogda Shan","China",43.8,88.332999999999998,5445,4122,"-","-","http://maps.google.com/maps?ll=43.800000,88.333000&spn=.175378,.297781&t=k&hl=en&output=embed"]
[null,"Namcha Barwa","China",29.633299999999998,95.05,7782,4106,"Bianba Zaxi  et al.","1992","http://maps.google.com/maps?ll=29.633300,95.050000&spn=.211205,.297781&t=k&hl=en&output=embed"]
[null,"Kinabalu","Malaysia",6.0666000000000002,116.56666,4095,4095,"H. Low, S. St. John","1858","http://maps.google.com/maps?ll=6.0666,116.56666&spn=.211205,.297781&t=k&hl=en&output=embed"]
[null,"Mt. Rainier","US",46.85,-121.7666,4393,4023,"Hazard Stevens, P.B. Van Trump","1870","http://maps.google.com/maps?ll=46.850000,-121.766600&spn=.166181,.297781&t=k&hl=en&output=embed"]
[null,"K2","Pakistan/China",35.892110000000002,76.514626000000007,8611,4017,"Achille Compagnoni, Lino Lacedelli","1954","http://maps.google.com/maps?ll=35.892110,76.514626&spn=.196849,.297781&t=k&hl=en&output=embed"]
[null,"Ras Dejen","Ethiopia",13.2333,38.366599999999998,4533,3980,"Ferret, Galinier","1841","http://maps.google.com/maps?ll=13.233300,38.366600&spn=.236534,.297781&t=k&hl=en&output=embed"]
[null,"Volcan Tajumulco","Guatemala",15.041954,-91.903724999999994,4220,3980,"-","-","http://maps.google.com/maps?ll=15.041954,-91.903725&spn=.234661,.297781&t=k&hl=en&output=embed"]
[null,"Pico Bolivar","Venezuela",8.5396020000000004,-71.047554000000005,4981,3957,"Enrique Bourgoin, H. Márquez Molina, Domingo Peña ","1935","http://maps.google.com/maps?ll=8.539602,-71.047554&spn=.240293,.297781&t=k&hl=en&output=embed"]
[null,"Mt. Fairweather","US/Canada",58.90766,-137.51964599999999,4671,3955,"Allen Carpé, Terris Moore","1931","http://maps.google.com/maps?ll=58.907660,-137.519646&spn=.125483,.297781&t=k&hl=en&output=embed"]
{"$rows_left_out":25}
{"sheet":"Calculations","index":2,"n_rows":91,"n_cols":16,"rows_kept":91,"cut":false,"hidden":false,"merged":[]}
[]
[null,"Calculations"]
[]
[null,"Control parameters"]
[]
[null,"Actual sort criterion",null,2]
[]
[null,"Actual snapshot start",null,27]
[null,"Actual selection in table",null,31]
[null,"Actual selection in raw data",null,31]
[null,"Actual URL",null,{"$f":"INDEX(Data!$J$5:$J$54,$D$10,1)","v":"http://maps.google.com/maps?ll=4.211262,9.176502&spn=.242330,.297781&t=k&hl=en&output=embed"}]
[]
[null,"Sort Table"]
[]
[null,"No.","Sort Criterion","Sort Dummy","Sorted Values","Position","Summit Name","Country","Elevation in m","Prominence in m","First Ascent by","Year","Lat changed","Long changed","Lat highlight","Long highlight"]
[null,1,{"$f":"OFFSET(Data!E5,0,$D$6)","v":8848},{"$f":"C16+B16/1000000","v":8848.0000010000003},{"$f":"LARGE($D$16:$D$65,B16)","v":8848.0000010000003},{"$f":"MATCH(E16,$D$16:$D$65,0)","v":1},{"$f":"INDEX(Data!B$5:B$54,$F16,1)","v":"Mt. Everest"},{"$f":"INDEX(Data!C$5:C$54,$F16,1)","v":"Nepal/Tibet"},{"$f":"INDEX(Data!F$5:F$54,$F16,1)","v":8848},{"$f":"INDEX(Data!G$5:G$54,$F16,1)","v":8848},{"$f":"INDEX(Data!H$5:H$54,$F16,1)","v":"Edmund Hillary, Tenzing Norgay"},{"$f":"INDEX(Data!I$5:I$54,$F16,1)","v":"1953"},25.2,85.4,{"$f":"IF($F16=myRawDataPosition,INDEX(M$16:M$65,$F16,1),NA())","v":{"$error":"#N/A"}},{"$f":"IF($F16=myRawDataPosition,INDEX(N$16:N$65,$F16,1),NA())","v":{"$error":"#N/A"}}]
[null,2,{"$f":"OFFSET(Data!E6,0,$D$6)","v":6962},{"$f":"C17+B17/1000000","v":6962.0000019999998},{"$f":"LARGE($D$16:$D$65,B17)","v":6962.0000019999998},{"$f":"MATCH(E17,$D$16:$D$65,0)","v":2},{"$f":"INDEX(Data!B$5:B$54,$F17,1)","v":"Aconcagua"},{"$f":"INDEX(Data!C$5:C$54,$F17,1)","v":"Argentina"},{"$f":"INDEX(Data!F$5:F$54,$F17,1)","v":6962},{"$f":"INDEX(Data!G$5:G$54,$F17,1)","v":6962},{"$f":"INDEX(Data!H$5:H$54,$F17,1)","v":"Matthias Zurbriggen"},{"$f":"INDEX(Data!I$5:I$54,$F17,1)","v":"1897"},-16,-68.8,{"$f":"IF($F17=myRawDataPosition,INDEX(Calculations!M$16:M$65,$F17,1),NA())","v":{"$error":"#N/A"}},{"$f":"IF($F17=myRawDataPosition,INDEX(Calculations!N$16:N$65,$F17,1),NA())","v":{"$error":"#N/A"}}]
[null,3,{"$f":"OFFSET(Data!E7,0,$D$6)","v":6138},6138.0000030000001,6138.0000030000001,3,{"$f":"INDEX(Data!B$5:B$54,$F18,1)","v":"Mt. McKinley (Denali)"},{"$f":"INDEX(Data!C$5:C$54,$F18,1)","v":"US"},{"$f":"INDEX(Data!F$5:F$54,$F18,1)","v":6194},{"$f":"INDEX(Data!G$5:G$54,$F18,1)","v":6138},{"$f":"INDEX(Data!H$5:H$54,$F18,1)","v":"Hudson Stuck"},{"$f":"INDEX(Data!I$5:I$54,$F18,1)","v":"1913"},59.3,-148.9,{"$f":"IF($F18=myRawDataPosition,INDEX(Calculations!M$16:M$65,$F18,1),NA())","v":{"$error":"#N/A"}},{"$f":"IF($F18=myRawDataPosition,INDEX(Calculations!N$16:N$65,$F18,1),NA())","v":{"$error":"#N/A"}}]
[null,4,{"$f":"OFFSET(Data!E8,0,$D$6)","v":5885},5885.0000040000004,5885.0000040000004,4,{"$f":"INDEX(Data!B$5:B$54,$F19,1)","v":"Kilimanjaro"},{"$f":"INDEX(Data!C$5:C$54,$F19,1)","v":"Tanzania"},{"$f":"INDEX(Data!F$5:F$54,$F19,1)","v":5895},{"$f":"INDEX(Data!G$5:G$54,$F19,1)","v":5885},{"$f":"INDEX(Data!H$5:H$54,$F19,1)","v":"Hans Meyer, Ludwig Purtscheller, Yohani Kinyala Lauwo"},{"$f":"INDEX(Data!I$5:I$54,$F19,1)","v":"1889"},4.3000000000000114,37.4,{"$f":"IF($F19=myRawDataPosition,INDEX(Calculations!M$16:M$65,$F19,1),NA())","v":{"$error":"#N/A"}},{"$f":"IF($F19=myRawDataPosition,INDEX(Calculations!N$16:N$65,$F19,1),NA())","v":{"$error":"#N/A"}}]
[null,5,{"$f":"OFFSET(Data!E9,0,$D$6)","v":5509},5509.0000049999999,5509.0000049999999,5,{"$f":"INDEX(Data!B$5:B$54,$F20,1)","v":"Cristobal Colon"},{"$f":"INDEX(Data!C$5:C$54,$F20,1)","v":"Colombia"},{"$f":"INDEX(Data!F$5:F$54,$F20,1)","v":5700},{"$f":"INDEX(Data!G$5:G$54,$F20,1)","v":5509},{"$f":"INDEX(Data!H$5:H$54,$F20,1)","v":"-"},{"$f":"INDEX(Data!I$5:I$54,$F20,1)","v":"-"},13.3,-72.5,{"$f":"IF($F20=myRawDataPosition,INDEX(Calculations!M$16:M$65,$F20,1),NA())","v":{"$error":"#N/A"}},{"$f":"IF($F20=myRawDataPosition,INDEX(Calculations!N$16:N$65,$F20,1),NA())","v":{"$error":"#N/A"}}]
[null,6,{"$f":"OFFSET(Data!E10,0,$D$6)","v":5250},5250.0000060000002,5250.0000060000002,6,{"$f":"INDEX(Data!B$5:B$54,$F21,1)","v":"Mt. Logan"},{"$f":"INDEX(Data!C$5:C$54,$F21,1)","v":"Canada"},{"$f":"INDEX(Data!F$5:F$54,$F21,1)","v":5959},{"$f":"INDEX(Data!G$5:G$54,$F21,1)","v":5250},{"$f":"INDEX(Data!H$5:H$54,$F21,1)","v":"Albert H. MacCarthy, W. W. Foster"},{"$f":"INDEX(Data!I$5:I$54,$F21,1)","v":"1925"},55.9,-138.30000000000001,{"$f":"IF($F21=myRawDataPosition,INDEX(Calculations!M$16:M$65,$F21,1),NA())","v":{"$error":"#N/A"}},{"$f":"IF($F21=myRawDataPosition,INDEX(Calculations!N$16:N$65,$F21,1),NA())","v":{"$error":"#N/A"}}]
[null,7,{"$f":"OFFSET(Data!E11,0,$D$6)","v":4922},4922.0000069999996,4922.0000069999996,7,{"$f":"INDEX(Data!B$5:B$54,$F22,1)","v":"Pico de Orizaba (Citlaltepetl)"},{"$f":"INDEX(Data!C$5:C$54,$F22,1)","v":"Mexico"},{"$f":"INDEX(Data!F$5:F$54,$F22,1)","v":5636},{"$f":"INDEX(Data!G$5:G$54,$F22,1)","v":4922},{"$f":"INDEX(Data!H$5:H$54,$F22,1)","v":"F. Maynard, G. Reynolds"},{"$f":"INDEX(Data!I$5:I$54,$F22,1)","v":"1848"},18.7,-95.7,{"$f":"IF($F22=myRawDataPosition,INDEX(Calculations!M$16:M$65,$F22,1),NA())","v":{"$error":"#N/A"}},{"$f":"IF($F22=myRawDataPosition,INDEX(Calculations!N$16:N$65,$F22,1),NA())","v":{"$error":"#N/A"}}]
[null,8,{"$f":"OFFSET(Data!E12,0,$D$6)","v":4892},4892.000008,4892.000008,8,{"$f":"INDEX(Data!B$5:B$54,$F23,1)","v":"Vinson Massif"},{"$f":"INDEX(Data!C$5:C$54,$F23,1)","v":"Antarctica"},{"$f":"INDEX(Data!F$5:F$54,$F23,1)","v":4892},{"$f":"INDEX(Data!G$5:G$54,$F23,1)","v":4892},{"$f":"INDEX(Data!H$5:H$54,$F23,1)","v":"Nicholas Clinch"},{"$f":"INDEX(Data!I$5:I$54,$F23,1)","v":"1966"},-78.510000000000005,-84.6,{"$f":"IF($F23=myRawDataPosition,INDEX(Calculations!M$16:M$65,$F23,1),NA())","v":{"$error":"#N/A"}},{"$f":"IF($F23=myRawDataPosition,INDEX(Calculations!N$16:N$65,$F23,1),NA())","v":{"$error":"#N/A"}}]
[null,9,{"$f":"OFFSET(Data!E13,0,$D$6)","v":4884},4884.0000090000003,4884.0000090000003,9,{"$f":"INDEX(Data!B$5:B$54,$F24,1)","v":"Puncak Jaya"},{"$f":"INDEX(Data!C$5:C$54,$F24,1)","v":"Indonesia"},{"$f":"INDEX(Data!F$5:F$54,$F24,1)","v":4884},{"$f":"INDEX(Data!G$5:G$54,$F24,1)","v":4884},{"$f":"INDEX(Data!H$5:H$54,$F24,1)","v":"Heinrich Harrer et al."},{"$f":"INDEX(Data!I$5:I$54,$F24,1)","v":"1962"},3.5,136.30000000000001,{"$f":"IF($F24=myRawDataPosition,INDEX(Calculations!M$16:M$65,$F24,1),NA())","v":{"$error":"#N/A"}},{"$f":"IF($F24=myRawDataPosition,INDEX(Calculations!N$16:N$65,$F24,1),NA())","v":{"$error":"#N/A"}}]
[null,10,{"$f":"OFFSET(Data!E14,0,$D$6)","v":4741},4741.0000099999997,4741.0000099999997,10,{"$f":"INDEX(Data!B$5:B$54,$F25,1)","v":"Gora Elbrus"},{"$f":"INDEX(Data!C$5:C$54,$F25,1)","v":"Russia"},{"$f":"INDEX(Data!F$5:F$54,$F25,1)","v":5642},{"$f":"INDEX(Data!G$5:G$54,$F25,1)","v":4741},{"$f":"INDEX(Data!H$5:H$54,$F25,1)","v":"Florence Crauford Grove, Frederick Gardner, Horace Walker, Peter Knubel"},{"$f":"INDEX(Data!I$5:I$54,$F25,1)","v":"1874"},37.700000000000003,42.3,{"$f":"IF($F25=myRawDataPosition,INDEX(Calculations!M$16:M$65,$F25,1),NA())","v":{"$error":"#N/A"}},{"$f":"IF($F25=myRawDataPosition,INDEX(Calculations!N$16:N$65,$F25,1),NA())","v":{"$error":"#N/A"}}]
[null,11,{"$f":"OFFSET(Data!E15,0,$D$6)","v":4696},4696.0000110000001,4696.0000110000001,11,{"$f":"INDEX(Data!B$5:B$54,$F26,1)","v":"Mont Blanc"},{"$f":"INDEX(Data!C$5:C$54,$F26,1)","v":"France/Italy"},{"$f":"INDEX(Data!F$5:F$54,$F26,1)","v":4809},{"$f":"INDEX(Data!G$5:G$54,$F26,1)","v":4696},{"$f":"INDEX(Data!H$5:H$54,$F26,1)","v":"Jacques Balmat, Michel-Gabriel Paccard"},{"$f":"INDEX(Data!I$5:I$54,$F26,1)","v":"1786 "},39.5,6.8659999999999997,{"$f":"IF($F26=myRawDataPosition,INDEX(Calculations!M$16:M$65,$F26,1),NA())","v":{"$error":"#N/A"}},{"$f":"IF($F26=myRawDataPosition,INDEX(Calculations!N$16:N$65,$F26,1),NA())","v":{"$error":"#N/A"}}]
[null,12,{"$f":"OFFSET(Data!E16,0,$D$6)","v":4667},4667.0000120000004,4667.0000120000004,12,{"$f":"INDEX(Data!B$5:B$54,$F27,1)","v":"Damavand"},{"$f":"INDEX(Data!C$5:C$54,$F27,1)","v":"Iran"},{"$f":"INDEX(Data!F$5:F$54,$F27,1)","v":5610},{"$f":"INDEX(Data!G$5:G$54,$F27,1)","v":4667},{"$f":"INDEX(Data!H$5:H$54,$F27,1)","v":"Abu Dolaf Kazraji"},{"$f":"INDEX(Data!I$5:I$54,$F27,1)","v":"905"},31.1,52,{"$f":"IF($F27=myRawDataPosition,INDEX(Calculations!M$16:M$65,$F27,1),NA())","v":{"$error":"#N/A"}},{"$f":"IF($F27=myRawDataPosition,INDEX(Calculations!N$16:N$65,$F27,1),NA())","v":{"$error":"#N/A"}}]
[null,13,{"$f":"OFFSET(Data!E17,0,$D$6)","v":4649},4649.0000129999999,4649.0000129999999,13,{"$f":"INDEX(Data!B$5:B$54,$F28,1)","v":"Klyuchevskaya Volcano"},{"$f":"INDEX(Data!C$5:C$54,$F28,1)","v":"Russia"},{"$f":"INDEX(Data!F$5:F$54,$F28,1)","v":4750},{"$f":"INDEX(Data!G$5:G$54,$F28,1)","v":4649},{"$f":"INDEX(Data!H$5:H$54,$F28,1)","v":"Daniel Gauss et al."},{"$f":"INDEX(Data!I$5:I$54,$F28,1)","v":"1788"},49.9,159.30000000000001,{"$f":"IF($F28=myRawDataPosition,INDEX(Calculations!M$16:M$65,$F28,1),NA())","v":{"$error":"#N/A"}},{"$f":"IF($F28=myRawDataPosition,INDEX(Calculations!N$16:N$65,$F28,1),NA())","v":{"$error":"#N/A"}}]
[null,14,{"$f":"OFFSET(Data!E18,0,$D$6)","v":4608},4608.0000140000002,4608.0000140000002,14,{"$f":"INDEX(Data!B$5:B$54,$F29,1)","v":"Nanga Parbat"},{"$f":"INDEX(Data!C$5:C$54,$F29,1)","v":"Pakistan"},{"$f":"INDEX(Data!F$5:F$54,$F29,1)","v":8125},{"$f":"INDEX(Data!G$5:G$54,$F29,1)","v":4608},{"$f":"INDEX(Data!H$5:H$54,$F29,1)","v":"Hermann Buhl"},{"$f":"INDEX(Data!I$5:I$54,$F29,1)","v":"1953"},30.5,73.2,{"$f":"IF($F29=myRawDataPosition,INDEX(Calculations!M$16:M$65,$F29,1),NA())","v":{"$error":"#N/A"}},{"$f":"IF($F29=myRawDataPosition,INDEX(Calculations!N$16:N$65,$F29,1),NA())","v":{"$error":"#N/A"}}]
[null,15,{"$f":"OFFSET(Data!E19,0,$D$6)","v":4205},4205.0000149999996,4205.0000149999996,15,{"$f":"INDEX(Data!B$5:B$54,$F30,1)","v":"Mauna Kea"},{"$f":"INDEX(Data!C$5:C$54,$F30,1)","v":"US"},{"$f":"INDEX(Data!F$5:F$54,$F30,1)","v":4205},{"$f":"INDEX(Data!G$5:G$54,$F30,1)","v":4205},{"$f":"INDEX(Data!H$5:H$54,$F30,1)","v":"-"},{"$f":"INDEX(Data!I$5:I$54,$F30,1)","v":"-"},19.399999999999999,-153.5,{"$f":"IF($F30=myRawDataPosition,INDEX(Calculations!M$16:M$65,$F30,1),NA())","v":{"$error":"#N/A"}},{"$f":"IF($F30=myRawDataPosition,INDEX(Calculations!N$16:N$65,$F30,1),NA())","v":{"$error":"#N/A"}}]
{"$rows_left_out":61}