{"text_format":"1","workbook":"xlsx","n_sheets":3,"sheets":["Dashboard","Data","Calculations"],"not_rendered":{"charts":3,"images":4,"macros":1,"external_links":0,"defined_names":11,"comments":0,"pivot_tables":0},"unopened":[],"bounds":{"document_bytes":16777216,"sheet_cells":100000,"rows_first":2000,"rows_last":500,"rows_between":2000,"halvings":0,"cell_chars":16384,"cell_head_chars":4096},"cells_cut":0,"cells_raw":0,"read":"whole","date_system":"1900"}

{"sheet":"Dashboard","index":0,"n_rows":29,"n_cols":11,"rows_kept":29,"cut":false,"hidden":false,"merged":[]}
[]
[null,"50 Most Prominent Summits on Earth - Bluffing Tableau Actions and Tooltips with Microsoft Excel (camera version)",null,null,null,null,null,null,null,"www.clearlyandsimply.com"]
[]
[]
[]
[]
[]
[]
[]
[]
[]
[]
[]
[]
[]
[]
[]
[]
[null,"No.",{"$f":"Data!B4","v":"Summit Name"},{"$f":"Data!C4","v":"Country"},{"$f":"Data!H4","v":"First Ascent by"},{"$f":"Data!I4","v":"Year"},{"$f":"Data!F4","v":"Elevation in m"},null,{"$f":"Data!G4","v":"Prominence in m"}]
[null,{"$f":"Calculations!E70","v":27},{"$f":"Calculations!G70","v":"Yu Shan"},{"$f":"Calculations!H70","v":"Taiwan"},{"$f":"Calculations!K70","v":"K. Stopel"},{"$f":"Calculations!L70","v":"1898"},{"$f":"Calculations!I70","v":3952},null,{"$f":"Calculations!J70","v":3952},null,{"$f":"Calculations!$F70","v":27}]
[null,{"$f":"Calculations!E71","v":28},{"$f":"Calculations!G71","v":"Ngaliema (Mt. Stanley)"},{"$f":"Calculations!H71","v":"Congo/Uganda"},{"$f":"Calculations!K71","v":"Duke of the Abruzzi et al."},{"$f":"Calculations!L71","v":"1906"},{"$f":"Calculations!I71","v":5109},null,{"$f":"Calculations!J71","v":3951},null,{"$f":"Calculations!$F71","v":28}]
[null,{"$f":"Calculations!E72","v":29},{"$f":"Calculations!G72","v":"Kangchenjunga"},{"$f":"Calculations!H72","v":"India/Nepal"},{"$f":"Calculations!K72","v":"George Band, Joe Brown"},{"$f":"Calculations!L72","v":"1955"},{"$f":"Calculations!I72","v":8586},null,{"$f":"Calculations!J72","v":3922},null,{"$f":"Calculations!$F72","v":29}]
[null,{"$f":"Calculations!E73","v":30},{"$f":"Calculations!G73","v":"Tirich Mir"},{"$f":"Calculations!H73","v":"Pakistan"},{"$f":"Calculations!K73","v":"Arne Næss, P. Kvernberg, H. Berg, Tony Streather"},{"$f":"Calculations!L73","v":"1950"},{"$f":"Calculations!I73","v":7708},null,{"$f":"Calculations!J73","v":3910},null,{"$f":"Calculations!$F73","v":30}]
[null,{"$f":"Calculations!E74","v":31},{"$f":"Calculations!G74","v":"Mt. Cameroon"},{"$f":"Calculations!H74","v":"Cameroon"},{"$f":"Calculations!K74","v":"Richard Francis Burton, Gustav Mann"},{"$f":"Calculations!L74","v":"1861"},{"$f":"Calculations!I74","v":4040},null,{"$f":"Calculations!J74","v":3901},null,{"$f":"Calculations!$F74","v":31}]
[null,{"$f":"Calculations!E75","v":32},{"$f":"Calculations!G75","v":"Mt. Kenya"},{"$f":"Calculations!H75","v":"Kenya"},{"$f":"Calculations!K75","v":"Halford Mackinder, Cesar Ollier, Joseph Brocherel"},{"$f":"Calculations!L75","v":"1899"},{"$f":"Calculations!I75","v":5199},null,{"$f":"Calculations!J75","v":3825},null,{"$f":"Calculations!$F75","v":32}]
[null,{"$f":"Calculations!E76","v":33},{"$f":"Calculations!G76","v":"Gunung Kerinci"},{"$f":"Calculations!H76","v":"Indonesia"},{"$f":"Calculations!K76","v":"Hasselt, Veth"},{"$f":"Calculations!L76","v":"1877"},{"$f":"Calculations!I76","v":3805},null,{"$f":"Calculations!J76","v":3805},null,{"$f":"Calculations!$F76","v":33}]
[null,{"$f":"Calculations!E77","v":34},{"$f":"Calculations!G77","v":"Mt. Erebus"},{"$f":"Calculations!H77","v":"Antarctica"},{"$f":"Calculations!K77","v":"Tannatt David,Douglas Mawson"},{"$f":"Calculations!L77","v":"1908"},{"$f":"Calculations!I77","v":3794},null,{"$f":"Calculations!J77","v":3794},null,{"$f":"Calculations!$F77","v":34}]
[null,{"$f":"Calculations!E78","v":35},{"$f":"Calculations!G78","v":"Fuji San"},{"$f":"Calculations!H78","v":"Japan"},{"$f":"Calculations!K78","v":"Unknown monk"},{"$f":"Calculations!L78","v":"663"},{"$f":"Calculations!I78","v":3776},null,{"$f":"Calculations!J78","v":3776},null,{"$f":"Calculations!$F78","v":35}]
[null,{"$f":"Calculations!E79","v":36},{"$f":"Calculations!G79","v":"Jebel Toubkal"},{"$f":"Calculations!H79","v":"Morocco"},{"$f":"Calculations!K79","v":"Marquis de Segonzac, V. Berger, H. Dolbeau"},{"$f":"Calculations!L79","v":"1923"},{"$f":"Calculations!I79","v":4167},null,{"$f":"Calculations!J79","v":3755},null,{"$f":"Calculations!$F79","v":37}]

{"sheet":"Data","index":1,"n_rows":54,"n_cols":10,"rows_kept":54,"cut":false,"hidden":false,"merged":[]}
[]
[null,"Data - 50 selected summits"]
[]
[null,"Summit Name","Country","Latitude","Longitude","Elevation in m","Prominence in m","First Ascent by","Year","Aerial link"]
[null,"Mt. Everest","Nepal/Tibet",27.986519000000001,86.919708,8848,8848,"Edmund Hillary, Tenzing Norgay","1953","http://maps.google.com/maps?ll=27.986519,86.919708&spn=.429142,.595562&t=k&hl=en&output=embed"]
[null,"Aconcagua","Argentina",-32.656286000000001,-70.015782999999999,6962,6962,"Matthias Zurbriggen","1897","http://maps.google.com/maps?ll=-32.656286,-70.015783&spn=.204576,.297781&t=k&hl=en&output=embed"]
[null,"Mt. McKinley (Denali)","US",63.098486999999999,-151.001587,6194,6138,"Hudson Stuck","1913","http://maps.google.com/maps?ll=63.098487,-151.001587&spn=.219883,.595562&t=k&hl=en&output=embed"]
[null,"Kilimanjaro","Tanzania",-3.0582389999999999,37.346648999999999,5895,5885,"Hans Meyer, Ludwig Purtscheller, Yohani Kinyala Lauwo","1889","http://maps.google.com/maps?ll=-3.058239,37.346649&spn=.121320,.148890&t=k&hl=en&output=embed"]
[null,"Cristobal Colon","Colombia",10.829765,-73.701096000000007,5700,5509,"-","-","http://maps.google.com/maps?ll=10.829765,-73.701096&spn=.238659,.297781&t=k&hl=en&output=embed"]
[null,"Mt. Logan","Canada",60.633468999999998,-140.439606,5959,5250,"Albert H. MacCarthy, W. W. Foster","1925","http://maps.google.com/maps?ll=60.633469,-140.439606&spn=.119159,.297781&t=k&hl=en&output=embed"]
[null,"Pico de Orizaba (Citlaltepetl)","Mexico",19.03,-97.266599999999997,5636,4922,"F. Maynard, G. Reynolds","1848","http://maps.google.com/maps?ll=19.030000,-97.266600&spn=.229706,.297781&t=k&hl=en&output=embed"]
[null,"Vinson Massif","Antarctica",-78.510000000000005,-85.6,4892,4892,"Nicholas Clinch","1966","http://maps.google.com/maps?ll=-78.510000,-85.600000&spn=6.274193,38.115967&t=k&hl=en&output=embed"]
[null,"Puncak Jaya","Indonesia",-4.0666000000000002,137.18333000000001,4884,4884,"Heinrich Harrer et al.","1962","http://maps.google.com/maps?ll=-4.066600,137.183330&spn=.242375,.297781&t=k&hl=en&output=embed"]
[null,"Gora Elbrus","Russia",43.35,42.433300000000003,5642,4741,"Florence Crauford Grove, Frederick Gardner, Horace Walker, Peter Knubel","1874","http://maps.google.com/maps?ll=43.350000,42.433300&spn=.353386,.595562&t=k&hl=en&output=embed"]
[null,"Mont Blanc","France/Italy",45.832999999999998,6.8659999999999997,4809,4696,"Jacques Balmat, Michel-Gabriel Paccard","1786 ","http://maps.google.com/maps?ll=45.833000,6.866000&spn=.169301,.297781&t=k&hl=en&output=embed"]
[null,"Damavand","Iran",35.954386999999997,52.111243999999999,5610,4667,"Abu Dolaf Kazraji","905","http://maps.google.com/maps?ll=35.954387,52.111244&spn=.196694,.297781&t=k&hl=en&output=embed"]
[null,"Klyuchevskaya Volcano","Russia",56.060153,160.63179,4750,4649,"Daniel Gauss et al.","1788","http://maps.google.com/maps?ll=56.060153,160.631790&spn=.271330,.595562&t=k&hl=en&output=embed"]
[null,"Nanga Parbat","Pakistan",35.2333,74.599999999999994,8125,4608,"Hermann Buhl","1953","http://maps.google.com/maps?ll=35.233300,74.600000&spn=.396945,.595562&t=k&hl=en&output=embed"]
[null,"Mauna Kea","US",19.824204000000002,-155.46752900000001,4205,4205,"-","-","http://maps.google.com/maps?ll=19.824204,-155.467529&spn=.228587,.297781&t=k&hl=en&output=embed"]
[null,"Jengish Chokusu (ex. Pik Pobedy)","Kyrgyzstan/China",42.033299999999997,80.116665999999995,7439,4148,"Witali Abalakow et al.","1956","http://maps.google.com/maps?ll=42.033300,80.116666&spn=.360958,.595562&t=k&hl=en&output=embed"]
[null,"Chimborazo","Ecuador",-1.467544,-78.816090000000003,6267,4122,"Edward Whymper","1880","http://maps.google.com/maps?ll=-1.467544,-78.816090&spn=.242907,.297781&t=k&hl=en&output=embed"]
[null,"Bogda Shan","China",43.8,88.332999999999998,5445,4122,"-","-","http://maps.google.com/maps?ll=43.800000,88.333000&spn=.175378,.297781&t=k&hl=en&output=embed"]
[null,"Namcha Barwa","China",29.633299999999998,95.05,7782,4106,"Bianba Zaxi  et al.","1992","http://maps.google.com/maps?ll=29.633300,95.050000&spn=.211205,.297781&t=k&hl=en&output=embed"]
[null,"Kinabalu","Malaysia",6.0666000000000002,116.56666,4095,4095,"H. Low, S. St. John","1858","http://maps.google.com/maps?ll=6.0666,116.56666&spn=.211205,.297781&t=k&hl=en&output=embed"]
[null,"Mt. Rainier","US",46.85,-121.7666,4393,4023,"Hazard Stevens, P.B. Van Trump","1870","http://maps.google.com/maps?ll=46.850000,-121.766600&spn=.166181,.297781&t=k&hl=en&output=embed"]
[null,"K2","Pakistan/China",35.892110000000002,76.514626000000007,8611,4017,"Achille Compagnoni, Lino Lacedelli","1954","http://maps.google.com/maps?ll=35.892110,76.514626&spn=.196849,.297781&t=k&hl=en&output=embed"]
[null,"Ras Dejen","Ethiopia",13.2333,38.366599999999998,4533,3980,"Ferret, Galinier","1841","http://maps.google.com/maps?ll=13.233300,38.366600&spn=.236534,.297781&t=k&hl=en&output=embed"]
[null,"Volcan Tajumulco","Guatemala",15.041954,-91.903724999999994,4220,3980,"-","-","http://maps.google.com/maps?ll=15.041954,-91.903725&spn=.234661,.297781&t=k&hl=en&output=embed"]
[null,"Pico Bolivar","Venezuela",8.5396020000000004,-71.047554000000005,4981,3957,"Enrique Bourgoin, H. Márquez Molina, Domingo Peña ","1935","http://maps.google.com/maps?ll=8.539602,-71.047554&spn=.240293,.297781&t=k&hl=en&output=embed"]
[null,"Mt. Fairweather","US/Canada",58.90766,-137.51964599999999,4671,3955,"Allen Carpé, Terris Moore","1931","http://maps.google.com/maps?ll=58.907660,-137.519646&spn=.125483,.297781&t=k&hl=en&output=embed"]
[null,"Yu Shan","Taiwan",23.468914999999999,120.957928,3952,3952,"K. Stopel","1898","http://maps.google.com/maps?ll=23.468915,120.957928&spn=.111443,.148890&t=k&hl=en&output=embed"]
[null,"Ngaliema (Mt. Stanley)","Congo/Uganda",0.38333299999999998,29.86666,5109,3951,"Duke of the Abruzzi et al.","1906","http://maps.google.com/maps?ll=.383333,29.866660&spn=.485961,.595562&t=k&hl=en&output=embed"]
[null,"Kangchenjunga","India/Nepal",27.718181000000001,88.154297,8586,3922,"George Band, Joe Brown","1955","http://maps.google.com/maps?ll=27.718181,88.154297&spn=.430205,.595562&t=k&hl=en&output=embed"]
[null,"Tirich Mir","Pakistan",36.255625000000002,71.842003000000005,7708,3910,"Arne Næss, P. Kvernberg, H. Berg, Tony Streather","1950","http://maps.google.com/maps?ll=36.255625,71.842003&spn=.195941,.297781&t=k&hl=en&output=embed"]
[null,"Mt. Cameroon","Cameroon",4.2112619999999996,9.1765019999999993,4040,3901,"Richard Francis Burton, Gustav Mann","1861","http://maps.google.com/maps?ll=4.211262,9.176502&spn=.242330,.297781&t=k&hl=en&output=embed"]
[null,"Mt. Kenya","Kenya",-0.153637,37.310600000000001,5199,3825,"Halford Mackinder, Cesar Ollier, Joseph Brocherel","1899","http://maps.google.com/maps?ll=-.153637,37.310600&spn=.242986,.297781&t=k&hl=en&output=embed"]
[null,"Gunung Kerinci","Indonesia",-1.695767,101.265793,3805,3805,"Hasselt, Veth","1877","http://maps.google.com/maps?ll=-1.695767,101.265793&spn=.121440,.148890&t=k&hl=en&output=embed"]
[null,"Mt. Erebus","Antarctica",-77.523122000000001,167.29980499999999,3794,3794,"Tannatt David,Douglas Mawson","1908","http://maps.google.com/maps?ll=-77.523122,167.299805&spn=3.370119,19.057983&t=k&hl=en&output=embed"]
[null,"Fuji San","Japan",35.359499999999997,138.73237499999999,3776,3776,"Unknown monk","663","http://maps.google.com/maps?ll=35.359500,138.732375&spn=0.099078,.148890&t=k&hl=en&output=embed"]
[null,"Mt. Cook","New Zealand",-43.592328000000002,170.14148700000001,3755,3755,"Tom Fyfe, George Graham, Jack Clarke","1894","http://maps.google.com/maps?ll=-43.592328,170.141487&spn=.175987,.297781&t=k&hl=en&output=embed"]
[null,"Jebel Toubkal","Morocco",31.066600000000001,-7.9133300000000002,4167,3755,"Marquis de Segonzac, V. Berger, H. Dolbeau","1923","http://maps.google.com/maps?ll=31.066600,-7.913330&spn=.208134,.297781&t=k&hl=en&output=embed"]
[null,"Cerro Chirripo","Costa Rica",9.4833300000000005,-83.513329999999996,3820,3727,"-","-","http://maps.google.com/maps?ll=9.483330,-83.513330&spn=.239666,.297781&t=k&hl=en&output=embed"]
[null,"Gunung Rinjani","Indonesia",-8.4159989999999993,116.462631,3726,3726,"-","-","http://maps.google.com/maps?ll=-8.415999,116.462631&spn=.120185,.148890&t=k&hl=en&output=embed"]
[null,"Pico Teide","Spain",28.272335000000002,-16.642399000000001,3718,3718,"Sir Edmund Scory","1582","http://maps.google.com/maps?ll=28.272335,-16.642399&spn=.107000,.148890&t=k&hl=en&output=embed"]
[null,"Monte San Valentin","Chile",-46.6,-73.333299999999994,4058,3696,"-","-","http://maps.google.com/maps?ll=-46.600000,-73.333300&spn=.667820,1.191124&t=k&hl=en&output=embed"]
[null,"Gunnbjørnsfjeld","Greenland",68.913330000000002,-29.9,3694,3694,"Augustine Cortauld, Jack Longland, Ebbe Munck, H.G. Wager, Laurence Wager","1935","http://maps.google.com/maps?ll=68.913330,-29.900000&spn=1.398864,4.764496&t=k&hl=en&output=embed"]
[null,"Nevado Ojos del Salado","Argentina/Chile",-27.118424000000001,-68.530311999999995,6893,3688,"Justyn Wojsznis, Jan Szczepanski","1937","http://maps.google.com/maps?ll=-27.118424,-68.530312&spn=.216274,.297781&t=k&hl=en&output=embed"]
[null,"Gunung Semeru","Indonesia",-8.1105560000000008,112.923317,3676,3676,"-","-","http://maps.google.com/maps?ll=-8.110556,112.923317&spn=.240556,.297781&t=k&hl=en&output=embed"]
[null,"Finisterre Range HP","Papua New Guinea",-5.95,146.36666,4125,3675,"Hugo Zöller","1889","http://maps.google.com/maps?ll=-5.950000,146.366660&spn=.241678,.297781&t=k&hl=en&output=embed"]
[null,"Ritacuba Blanco","Colombia",6.3733060000000004,-72.298278999999994,5410,3645,"-","-","http://maps.google.com/maps?ll=6.373306,-72.298279&spn=.482968,.595562&t=k&hl=en&output=embed"]
[null,"Minya Konka","China",29.6,101.88333,7556,3642,"US american explorer team","1932","http://maps.google.com/maps?ll=29.600000,101.883330&spn=.422549,.595562&t=k&hl=en&output=embed"]
[null,"Mt. Ararat (Agri Dagi)","Turkey",39.708243000000003,44.290008999999998,5137,3611,"J. J. Friedrich Parrot jun.","1829","http://maps.google.com/maps?ll=39.708243,44.290009&spn=.186931,.297781&t=k&hl=en&output=embed"]
[null,"Kongur Shan","China",38.588966999999997,75.297545999999997,7649,3585,"Chris Bonington, Al Rouse, Peter Boardman, Joe Tasker","1981","http://maps.google.com/maps?ll=38.588967,75.297546&spn=.759711,1.191124&t=k&hl=en&output=embed"]
[null,"Mt. Blackburn","US",61.732216999999999,-143.42599899999999,4996,3535,"Bruce Gilbert, Dick Wahlstrom, Hans Gmoser, Adolf Bitterlich, Leon Blumer","1958","http://maps.google.com/maps?ll=61.732217,-143.425999&spn=.230152,.595562&t=k&hl=en&output=embed"]

{"sheet":"Calculations","index":2,"n_rows":91,"n_cols":16,"rows_kept":91,"cut":false,"hidden":false,"merged":[]}
[]
[null,"Calculations"]
[]
[null,"Control parameters"]
[]
[null,"Actual sort criterion",null,2]
[]
[null,"Actual snapshot start",null,27]
[null,"Actual selection in table",null,31]
[null,"Actual selection in raw data",null,31]
[null,"Actual URL",null,{"$f":"INDEX(Data!$J$5:$J$54,$D$10,1)","v":"http://maps.google.com/maps?ll=4.211262,9.176502&spn=.242330,.297781&t=k&hl=en&output=embed"}]
[]
[null,"Sort Table"]
[]
[null,"No.","Sort Criterion","Sort Dummy","Sorted Values","Position","Summit Name","Country","Elevation in m","Prominence in m","First Ascent by","Year","Lat changed","Long changed","Lat highlight","Long highlight"]
[null,1,{"$f":"OFFSET(Data!E5,0,$D$6)","v":8848},{"$f":"C16+B16/1000000","v":8848.0000010000003},{"$f":"LARGE($D$16:$D$65,B16)","v":8848.0000010000003},{"$f":"MATCH(E16,$D$16:$D$65,0)","v":1},{"$f":"INDEX(Data!B$5:B$54,$F16,1)","v":"Mt. Everest"},{"$f":"INDEX(Data!C$5:C$54,$F16,1)","v":"Nepal/Tibet"},{"$f":"INDEX(Data!F$5:F$54,$F16,1)","v":8848},{"$f":"INDEX(Data!G$5:G$54,$F16,1)","v":8848},{"$f":"INDEX(Data!H$5:H$54,$F16,1)","v":"Edmund Hillary, Tenzing Norgay"},{"$f":"INDEX(Data!I$5:I$54,$F16,1)","v":"1953"},25.2,85.4,{"$f":"IF($F16=myRawDataPosition,INDEX(M$16:M$65,$F16,1),NA())","v":{"$error":"#N/A"}},{"$f":"IF($F16=myRawDataPosition,INDEX(N$16:N$65,$F16,1),NA())","v":{"$error":"#N/A"}}]
[null,2,{"$f":"OFFSET(Data!E6,0,$D$6)","v":6962},{"$f":"C17+B17/1000000","v":6962.0000019999998},{"$f":"LARGE($D$16:$D$65,B17)","v":6962.0000019999998},{"$f":"MATCH(E17,$D$16:$D$65,0)","v":2},{"$f":"INDEX(Data!B$5:B$54,$F17,1)","v":"Aconcagua"},{"$f":"INDEX(Data!C$5:C$54,$F17,1)","v":"Argentina"},{"$f":"INDEX(Data!F$5:F$54,$F17,1)","v":6962},{"$f":"INDEX(Data!G$5:G$54,$F17,1)","v":6962},{"$f":"INDEX(Data!H$5:H$54,$F17,1)","v":"Matthias Zurbriggen"},{"$f":"INDEX(Data!I$5:I$54,$F17,1)","v":"1897"},-16,-68.8,{"$f":"IF($F17=myRawDataPosition,INDEX(Calculations!M$16:M$65,$F17,1),NA())","v":{"$error":"#N/A"}},{"$f":"IF($F17=myRawDataPosition,INDEX(Calculations!N$16:N$65,$F17,1),NA())","v":{"$error":"#N/A"}}]
[null,3,{"$f":"OFFSET(Data!E7,0,$D$6)","v":6138},6138.0000030000001,6138.0000030000001,3,{"$f":"INDEX(Data!B$5:B$54,$F18,1)","v":"Mt. McKinley (Denali)"},{"$f":"INDEX(Data!C$5:C$54,$F18,1)","v":"US"},{"$f":"INDEX(Data!F$5:F$54,$F18,1)","v":6194},{"$f":"INDEX(Data!G$5:G$54,$F18,1)","v":6138},{"$f":"INDEX(Data!H$5:H$54,$F18,1)","v":"Hudson Stuck"},{"$f":"INDEX(Data!I$5:I$54,$F18,1)","v":"1913"},59.3,-148.9,{"$f":"IF($F18=myRawDataPosition,INDEX(Calculations!M$16:M$65,$F18,1),NA())","v":{"$error":"#N/A"}},{"$f":"IF($F18=myRawDataPosition,INDEX(Calculations!N$16:N$65,$F18,1),NA())","v":{"$error":"#N/A"}}]
[null,4,{"$f":"OFFSET(Data!E8,0,$D$6)","v":5885},5885.0000040000004,5885.0000040000004,4,{"$f":"INDEX(Data!B$5:B$54,$F19,1)","v":"Kilimanjaro"},{"$f":"INDEX(Data!C$5:C$54,$F19,1)","v":"Tanzania"},{"$f":"INDEX(Data!F$5:F$54,$F19,1)","v":5895},{"$f":"INDEX(Data!G$5:G$54,$F19,1)","v":5885},{"$f":"INDEX(Data!H$5:H$54,$F19,1)","v":"Hans Meyer, Ludwig Purtscheller, Yohani Kinyala Lauwo"},{"$f":"INDEX(Data!I$5:I$54,$F19,1)","v":"1889"},4.3000000000000114,37.4,{"$f":"IF($F19=myRawDataPosition,INDEX(Calculations!M$16:M$65,$F19,1),NA())","v":{"$error":"#N/A"}},{"$f":"IF($F19=myRawDataPosition,INDEX(Calculations!N$16:N$65,$F19,1),NA())","v":{"$error":"#N/A"}}]
[null,5,{"$f":"OFFSET(Data!E9,0,$D$6)","v":5509},5509.0000049999999,5509.0000049999999,5,{"$f":"INDEX(Data!B$5:B$54,$F20,1)","v":"Cristobal Colon"},{"$f":"INDEX(Data!C$5:C$54,$F20,1)","v":"Colombia"},{"$f":"INDEX(Data!F$5:F$54,$F20,1)","v":5700},{"$f":"INDEX(Data!G$5:G$54,$F20,1)","v":5509},{"$f":"INDEX(Data!H$5:H$54,$F20,1)","v":"-"},{"$f":"INDEX(Data!I$5:I$54,$F20,1)","v":"-"},13.3,-72.5,{"$f":"IF($F20=myRawDataPosition,INDEX(Calculations!M$16:M$65,$F20,1),NA())","v":{"$error":"#N/A"}},{"$f":"IF($F20=myRawDataPosition,INDEX(Calculations!N$16:N$65,$F20,1),NA())","v":{"$error":"#N/A"}}]
[null,6,{"$f":"OFFSET(Data!E10,0,$D$6)","v":5250},5250.0000060000002,5250.0000060000002,6,{"$f":"INDEX(Data!B$5:B$54,$F21,1)","v":"Mt. Logan"},{"$f":"INDEX(Data!C$5:C$54,$F21,1)","v":"Canada"},{"$f":"INDEX(Data!F$5:F$54,$F21,1)","v":5959},{"$f":"INDEX(Data!G$5:G$54,$F21,1)","v":5250},{"$f":"INDEX(Data!H$5:H$54,$F21,1)","v":"Albert H. MacCarthy, W. W. Foster"},{"$f":"INDEX(Data!I$5:I$54,$F21,1)","v":"1925"},55.9,-138.30000000000001,{"$f":"IF($F21=myRawDataPosition,INDEX(Calculations!M$16:M$65,$F21,1),NA())","v":{"$error":"#N/A"}},{"$f":"IF($F21=myRawDataPosition,INDEX(Calculations!N$16:N$65,$F21,1),NA())","v":{"$error":"#N/A"}}]
[null,7,{"$f":"OFFSET(Data!E11,0,$D$6)","v":4922},4922.0000069999996,4922.0000069999996,7,{"$f":"INDEX(Data!B$5:B$54,$F22,1)","v":"Pico de Orizaba (Citlaltepetl)"},{"$f":"INDEX(Data!C$5:C$54,$F22,1)","v":"Mexico"},{"$f":"INDEX(Data!F$5:F$54,$F22,1)","v":5636},{"$f":"INDEX(Data!G$5:G$54,$F22,1)","v":4922},{"$f":"INDEX(Data!H$5:H$54,$F22,1)","v":"F. Maynard, G. Reynolds"},{"$f":"INDEX(Data!I$5:I$54,$F22,1)","v":"1848"},18.7,-95.7,{"$f":"IF($F22=myRawDataPosition,INDEX(Calculations!M$16:M$65,$F22,1),NA())","v":{"$error":"#N/A"}},{"$f":"IF($F22=myRawDataPosition,INDEX(Calculations!N$16:N$65,$F22,1),NA())","v":{"$error":"#N/A"}}]
[null,8,{"$f":"OFFSET(Data!E12,0,$D$6)","v":4892},4892.000008,4892.000008,8,{"$f":"INDEX(Data!B$5:B$54,$F23,1)","v":"Vinson Massif"},{"$f":"INDEX(Data!C$5:C$54,$F23,1)","v":"Antarctica"},{"$f":"INDEX(Data!F$5:F$54,$F23,1)","v":4892},{"$f":"INDEX(Data!G$5:G$54,$F23,1)","v":4892},{"$f":"INDEX(Data!H$5:H$54,$F23,1)","v":"Nicholas Clinch"},{"$f":"INDEX(Data!I$5:I$54,$F23,1)","v":"1966"},-78.510000000000005,-84.6,{"$f":"IF($F23=myRawDataPosition,INDEX(Calculations!M$16:M$65,$F23,1),NA())","v":{"$error":"#N/A"}},{"$f":"IF($F23=myRawDataPosition,INDEX(Calculations!N$16:N$65,$F23,1),NA())","v":{"$error":"#N/A"}}]
[null,9,{"$f":"OFFSET(Data!E13,0,$D$6)","v":4884},4884.0000090000003,4884.0000090000003,9,{"$f":"INDEX(Data!B$5:B$54,$F24,1)","v":"Puncak Jaya"},{"$f":"INDEX(Data!C$5:C$54,$F24,1)","v":"Indonesia"},{"$f":"INDEX(Data!F$5:F$54,$F24,1)","v":4884},{"$f":"INDEX(Data!G$5:G$54,$F24,1)","v":4884},{"$f":"INDEX(Data!H$5:H$54,$F24,1)","v":"Heinrich Harrer et al."},{"$f":"INDEX(Data!I$5:I$54,$F24,1)","v":"1962"},3.5,136.30000000000001,{"$f":"IF($F24=myRawDataPosition,INDEX(Calculations!M$16:M$65,$F24,1),NA())","v":{"$error":"#N/A"}},{"$f":"IF($F24=myRawDataPosition,INDEX(Calculations!N$16:N$65,$F24,1),NA())","v":{"$error":"#N/A"}}]
[null,10,{"$f":"OFFSET(Data!E14,0,$D$6)","v":4741},4741.0000099999997,4741.0000099999997,10,{"$f":"INDEX(Data!B$5:B$54,$F25,1)","v":"Gora Elbrus"},{"$f":"INDEX(Data!C$5:C$54,$F25,1)","v":"Russia"},{"$f":"INDEX(Data!F$5:F$54,$F25,1)","v":5642},{"$f":"INDEX(Data!G$5:G$54,$F25,1)","v":4741},{"$f":"INDEX(Data!H$5:H$54,$F25,1)","v":"Florence Crauford Grove, Frederick Gardner, Horace Walker, Peter Knubel"},{"$f":"INDEX(Data!I$5:I$54,$F25,1)","v":"1874"},37.700000000000003,42.3,{"$f":"IF($F25=myRawDataPosition,INDEX(Calculations!M$16:M$65,$F25,1),NA())","v":{"$error":"#N/A"}},{"$f":"IF($F25=myRawDataPosition,INDEX(Calculations!N$16:N$65,$F25,1),NA())","v":{"$error":"#N/A"}}]
[null,11,{"$f":"OFFSET(Data!E15,0,$D$6)","v":4696},4696.0000110000001,4696.0000110000001,11,{"$f":"INDEX(Data!B$5:B$54,$F26,1)","v":"Mont Blanc"},{"$f":"INDEX(Data!C$5:C$54,$F26,1)","v":"France/Italy"},{"$f":"INDEX(Data!F$5:F$54,$F26,1)","v":4809},{"$f":"INDEX(Data!G$5:G$54,$F26,1)","v":4696},{"$f":"INDEX(Data!H$5:H$54,$F26,1)","v":"Jacques Balmat, Michel-Gabriel Paccard"},{"$f":"INDEX(Data!I$5:I$54,$F26,1)","v":"1786 "},39.5,6.8659999999999997,{"$f":"IF($F26=myRawDataPosition,INDEX(Calculations!M$16:M$65,$F26,1),NA())","v":{"$error":"#N/A"}},{"$f":"IF($F26=myRawDataPosition,INDEX(Calculations!N$16:N$65,$F26,1),NA())","v":{"$error":"#N/A"}}]
[null,12,{"$f":"OFFSET(Data!E16,0,$D$6)","v":4667},4667.0000120000004,4667.0000120000004,12,{"$f":"INDEX(Data!B$5:B$54,$F27,1)","v":"Damavand"},{"$f":"INDEX(Data!C$5:C$54,$F27,1)","v":"Iran"},{"$f":"INDEX(Data!F$5:F$54,$F27,1)","v":5610},{"$f":"INDEX(Data!G$5:G$54,$F27,1)","v":4667},{"$f":"INDEX(Data!H$5:H$54,$F27,1)","v":"Abu Dolaf Kazraji"},{"$f":"INDEX(Data!I$5:I$54,$F27,1)","v":"905"},31.1,52,{"$f":"IF($F27=myRawDataPosition,INDEX(Calculations!M$16:M$65,$F27,1),NA())","v":{"$error":"#N/A"}},{"$f":"IF($F27=myRawDataPosition,INDEX(Calculations!N$16:N$65,$F27,1),NA())","v":{"$error":"#N/A"}}]
[null,13,{"$f":"OFFSET(Data!E17,0,$D$6)","v":4649},4649.0000129999999,4649.0000129999999,13,{"$f":"INDEX(Data!B$5:B$54,$F28,1)","v":"Klyuchevskaya Volcano"},{"$f":"INDEX(Data!C$5:C$54,$F28,1)","v":"Russia"},{"$f":"INDEX(Data!F$5:F$54,$F28,1)","v":4750},{"$f":"INDEX(Data!G$5:G$54,$F28,1)","v":4649},{"$f":"INDEX(Data!H$5:H$54,$F28,1)","v":"Daniel Gauss et al."},{"$f":"INDEX(Data!I$5:I$54,$F28,1)","v":"1788"},49.9,159.30000000000001,{"$f":"IF($F28=myRawDataPosition,INDEX(Calculations!M$16:M$65,$F28,1),NA())","v":{"$error":"#N/A"}},{"$f":"IF($F28=myRawDataPosition,INDEX(Calculations!N$16:N$65,$F28,1),NA())","v":{"$error":"#N/A"}}]
[null,14,{"$f":"OFFSET(Data!E18,0,$D$6)","v":4608},4608.0000140000002,4608.0000140000002,14,{"$f":"INDEX(Data!B$5:B$54,$F29,1)","v":"Nanga Parbat"},{"$f":"INDEX(Data!C$5:C$54,$F29,1)","v":"Pakistan"},{"$f":"INDEX(Data!F$5:F$54,$F29,1)","v":8125},{"$f":"INDEX(Data!G$5:G$54,$F29,1)","v":4608},{"$f":"INDEX(Data!H$5:H$54,$F29,1)","v":"Hermann Buhl"},{"$f":"INDEX(Data!I$5:I$54,$F29,1)","v":"1953"},30.5,73.2,{"$f":"IF($F29=myRawDataPosition,INDEX(Calculations!M$16:M$65,$F29,1),NA())","v":{"$error":"#N/A"}},{"$f":"IF($F29=myRawDataPosition,INDEX(Calculations!N$16:N$65,$F29,1),NA())","v":{"$error":"#N/A"}}]
[null,15,{"$f":"OFFSET(Data!E19,0,$D$6)","v":4205},4205.0000149999996,4205.0000149999996,15,{"$f":"INDEX(Data!B$5:B$54,$F30,1)","v":"Mauna Kea"},{"$f":"INDEX(Data!C$5:C$54,$F30,1)","v":"US"},{"$f":"INDEX(Data!F$5:F$54,$F30,1)","v":4205},{"$f":"INDEX(Data!G$5:G$54,$F30,1)","v":4205},{"$f":"INDEX(Data!H$5:H$54,$F30,1)","v":"-"},{"$f":"INDEX(Data!I$5:I$54,$F30,1)","v":"-"},19.399999999999999,-153.5,{"$f":"IF($F30=myRawDataPosition,INDEX(Calculations!M$16:M$65,$F30,1),NA())","v":{"$error":"#N/A"}},{"$f":"IF($F30=myRawDataPosition,INDEX(Calculations!N$16:N$65,$F30,1),NA())","v":{"$error":"#N/A"}}]
[null,16,{"$f":"OFFSET(Data!E20,0,$D$6)","v":4148},4148.000016,4148.000016,16,{"$f":"INDEX(Data!B$5:B$54,$F31,1)","v":"Jengish Chokusu (ex. Pik Pobedy)"},{"$f":"INDEX(Data!C$5:C$54,$F31,1)","v":"Kyrgyzstan/China"},{"$f":"INDEX(Data!F$5:F$54,$F31,1)","v":7439},{"$f":"INDEX(Data!G$5:G$54,$F31,1)","v":4148},{"$f":"INDEX(Data!H$5:H$54,$F31,1)","v":"Witali Abalakow et al."},{"$f":"INDEX(Data!I$5:I$54,$F31,1)","v":"1956"},36.299999999999997,79.5,{"$f":"IF($F31=myRawDataPosition,INDEX(Calculations!M$16:M$65,$F31,1),NA())","v":{"$error":"#N/A"}},{"$f":"IF($F31=myRawDataPosition,INDEX(Calculations!N$16:N$65,$F31,1),NA())","v":{"$error":"#N/A"}}]
[null,17,{"$f":"OFFSET(Data!E21,0,$D$6)","v":4122},4122.0000170000003,4122.0000179999997,18,{"$f":"INDEX(Data!B$5:B$54,$F32,1)","v":"Bogda Shan"},{"$f":"INDEX(Data!C$5:C$54,$F32,1)","v":"China"},{"$f":"INDEX(Data!F$5:F$54,$F32,1)","v":5445},{"$f":"INDEX(Data!G$5:G$54,$F32,1)","v":4122},{"$f":"INDEX(Data!H$5:H$54,$F32,1)","v":"-"},{"$f":"INDEX(Data!I$5:I$54,$F32,1)","v":"-"},5.5,-77.7,{"$f":"IF($F32=myRawDataPosition,INDEX(Calculations!M$16:M$65,$F32,1),NA())","v":{"$error":"#N/A"}},{"$f":"IF($F32=myRawDataPosition,INDEX(Calculations!N$16:N$65,$F32,1),NA())","v":{"$error":"#N/A"}}]
[null,18,{"$f":"OFFSET(Data!E22,0,$D$6)","v":4122},4122.0000179999997,4122.0000170000003,17,{"$f":"INDEX(Data!B$5:B$54,$F33,1)","v":"Chimborazo"},{"$f":"INDEX(Data!C$5:C$54,$F33,1)","v":"Ecuador"},{"$f":"INDEX(Data!F$5:F$54,$F33,1)","v":6267},{"$f":"INDEX(Data!G$5:G$54,$F33,1)","v":4122},{"$f":"INDEX(Data!H$5:H$54,$F33,1)","v":"Edward Whymper"},{"$f":"INDEX(Data!I$5:I$54,$F33,1)","v":"1880"},37.9,87.9,{"$f":"IF($F33=myRawDataPosition,INDEX(Calculations!M$16:M$65,$F33,1),NA())","v":{"$error":"#N/A"}},{"$f":"IF($F33=myRawDataPosition,INDEX(Calculations!N$16:N$65,$F33,1),NA())","v":{"$error":"#N/A"}}]
[null,19,{"$f":"OFFSET(Data!E23,0,$D$6)","v":4106},4106.0000190000001,4106.0000190000001,19,{"$f":"INDEX(Data!B$5:B$54,$F34,1)","v":"Namcha Barwa"},{"$f":"INDEX(Data!C$5:C$54,$F34,1)","v":"China"},{"$f":"INDEX(Data!F$5:F$54,$F34,1)","v":7782},{"$f":"INDEX(Data!G$5:G$54,$F34,1)","v":4106},{"$f":"INDEX(Data!H$5:H$54,$F34,1)","v":"Bianba Zaxi  et al."},{"$f":"INDEX(Data!I$5:I$54,$F34,1)","v":"1992"},26.2,94.2,{"$f":"IF($F34=myRawDataPosition,INDEX(Calculations!M$16:M$65,$F34,1),NA())","v":{"$error":"#N/A"}},{"$f":"IF($F34=myRawDataPosition,INDEX(Calculations!N$16:N$65,$F34,1),NA())","v":{"$error":"#N/A"}}]
[null,20,{"$f":"OFFSET(Data!E24,0,$D$6)","v":4095},4095.0000199999999,4095.0000199999999,20,{"$f":"INDEX(Data!B$5:B$54,$F35,1)","v":"Kinabalu"},{"$f":"INDEX(Data!C$5:C$54,$F35,1)","v":"Malaysia"},{"$f":"INDEX(Data!F$5:F$54,$F35,1)","v":4095},{"$f":"INDEX(Data!G$5:G$54,$F35,1)","v":4095},{"$f":"INDEX(Data!H$5:H$54,$F35,1)","v":"H. Low, S. St. John"},{"$f":"INDEX(Data!I$5:I$54,$F35,1)","v":"1858"},10,115.8,{"$f":"IF($F35=myRawDataPosition,INDEX(Calculations!M$16:M$65,$F35,1),NA())","v":{"$error":"#N/A"}},{"$f":"IF($F35=myRawDataPosition,INDEX(Calculations!N$16:N$65,$F35,1),NA())","v":{"$error":"#N/A"}}]
[null,21,{"$f":"OFFSET(Data!E25,0,$D$6)","v":4023},4023.0000209999998,4023.0000209999998,21,{"$f":"INDEX(Data!B$5:B$54,$F36,1)","v":"Mt. Rainier"},{"$f":"INDEX(Data!C$5:C$54,$F36,1)","v":"US"},{"$f":"INDEX(Data!F$5:F$54,$F36,1)","v":4393},{"$f":"INDEX(Data!G$5:G$54,$F36,1)","v":4023},{"$f":"INDEX(Data!H$5:H$54,$F36,1)","v":"Hazard Stevens, P.B. Van Trump"},{"$f":"INDEX(Data!I$5:I$54,$F36,1)","v":"1870"},40.799999999999997,-120.4,{"$f":"IF($F36=myRawDataPosition,INDEX(Calculations!M$16:M$65,$F36,1),NA())","v":{"$error":"#N/A"}},{"$f":"IF($F36=myRawDataPosition,INDEX(Calculations!N$16:N$65,$F36,1),NA())","v":{"$error":"#N/A"}}]
[null,22,{"$f":"OFFSET(Data!E26,0,$D$6)","v":4017},4017.0000220000002,4017.0000220000002,22,{"$f":"INDEX(Data!B$5:B$54,$F37,1)","v":"K2"},{"$f":"INDEX(Data!C$5:C$54,$F37,1)","v":"Pakistan/China"},{"$f":"INDEX(Data!F$5:F$54,$F37,1)","v":8611},{"$f":"INDEX(Data!G$5:G$54,$F37,1)","v":4017},{"$f":"INDEX(Data!H$5:H$54,$F37,1)","v":"Achille Compagnoni, Lino Lacedelli"},{"$f":"INDEX(Data!I$5:I$54,$F37,1)","v":"1954"},31.2,75.7,{"$f":"IF($F37=myRawDataPosition,INDEX(Calculations!M$16:M$65,$F37,1),NA())","v":{"$error":"#N/A"}},{"$f":"IF($F37=myRawDataPosition,INDEX(Calculations!N$16:N$65,$F37,1),NA())","v":{"$error":"#N/A"}}]
[null,23,{"$f":"OFFSET(Data!E27,0,$D$6)","v":3980},3980.0000230000001,3980.0000239999999,24,{"$f":"INDEX(Data!B$5:B$54,$F38,1)","v":"Volcan Tajumulco"},{"$f":"INDEX(Data!C$5:C$54,$F38,1)","v":"Guatemala"},{"$f":"INDEX(Data!F$5:F$54,$F38,1)","v":4220},{"$f":"INDEX(Data!G$5:G$54,$F38,1)","v":3980},{"$f":"INDEX(Data!H$5:H$54,$F38,1)","v":"-"},{"$f":"INDEX(Data!I$5:I$54,$F38,1)","v":"-"},14.8,37.9,{"$f":"IF($F38=myRawDataPosition,INDEX(Calculations!M$16:M$65,$F38,1),NA())","v":{"$error":"#N/A"}},{"$f":"IF($F38=myRawDataPosition,INDEX(Calculations!N$16:N$65,$F38,1),NA())","v":{"$error":"#N/A"}}]
[null,24,{"$f":"OFFSET(Data!E28,0,$D$6)","v":3980},3980.0000239999999,3980.0000230000001,23,{"$f":"INDEX(Data!B$5:B$54,$F39,1)","v":"Ras Dejen"},{"$f":"INDEX(Data!C$5:C$54,$F39,1)","v":"Ethiopia"},{"$f":"INDEX(Data!F$5:F$54,$F39,1)","v":4533},{"$f":"INDEX(Data!G$5:G$54,$F39,1)","v":3980},{"$f":"INDEX(Data!H$5:H$54,$F39,1)","v":"Ferret, Galinier"},{"$f":"INDEX(Data!I$5:I$54,$F39,1)","v":"1841"},16.2,-90.8,{"$f":"IF($F39=myRawDataPosition,INDEX(Calculations!M$16:M$65,$F39,1),NA())","v":{"$error":"#N/A"}},{"$f":"IF($F39=myRawDataPosition,INDEX(Calculations!N$16:N$65,$F39,1),NA())","v":{"$error":"#N/A"}}]
[null,25,{"$f":"OFFSET(Data!E29,0,$D$6)","v":3957},3957.0000249999998,3957.0000249999998,25,{"$f":"INDEX(Data!B$5:B$54,$F40,1)","v":"Pico Bolivar"},{"$f":"INDEX(Data!C$5:C$54,$F40,1)","v":"Venezuela"},{"$f":"INDEX(Data!F$5:F$54,$F40,1)","v":4981},{"$f":"INDEX(Data!G$5:G$54,$F40,1)","v":3957},{"$f":"INDEX(Data!H$5:H$54,$F40,1)","v":"Enrique Bourgoin, H. Márquez Molina, Domingo Peña "},{"$f":"INDEX(Data!I$5:I$54,$F40,1)","v":"1935"},11.8,-69.8,{"$f":"IF($F40=myRawDataPosition,INDEX(Calculations!M$16:M$65,$F40,1),NA())","v":{"$error":"#N/A"}},{"$f":"IF($F40=myRawDataPosition,INDEX(Calculations!N$16:N$65,$F40,1),NA())","v":{"$error":"#N/A"}}]
[null,26,{"$f":"OFFSET(Data!E30,0,$D$6)","v":3955},3955.0000260000002,3955.0000260000002,26,{"$f":"INDEX(Data!B$5:B$54,$F41,1)","v":"Mt. Fairweather"},{"$f":"INDEX(Data!C$5:C$54,$F41,1)","v":"US/Canada"},{"$f":"INDEX(Data!F$5:F$54,$F41,1)","v":4671},{"$f":"INDEX(Data!G$5:G$54,$F41,1)","v":3955},{"$f":"INDEX(Data!H$5:H$54,$F41,1)","v":"Allen Carpé, Terris Moore"},{"$f":"INDEX(Data!I$5:I$54,$F41,1)","v":"1931"},53.9,-135.5,{"$f":"IF($F41=myRawDataPosition,INDEX(Calculations!M$16:M$65,$F41,1),NA())","v":{"$error":"#N/A"}},{"$f":"IF($F41=myRawDataPosition,INDEX(Calculations!N$16:N$65,$F41,1),NA())","v":{"$error":"#N/A"}}]
[null,27,{"$f":"OFFSET(Data!E31,0,$D$6)","v":3952},3952.000027,3952.000027,27,{"$f":"INDEX(Data!B$5:B$54,$F42,1)","v":"Yu Shan"},{"$f":"INDEX(Data!C$5:C$54,$F42,1)","v":"Taiwan"},{"$f":"INDEX(Data!F$5:F$54,$F42,1)","v":3952},{"$f":"INDEX(Data!G$5:G$54,$F42,1)","v":3952},{"$f":"INDEX(Data!H$5:H$54,$F42,1)","v":"K. Stopel"},{"$f":"INDEX(Data!I$5:I$54,$F42,1)","v":"1898"},21.6,120.5,{"$f":"IF($F42=myRawDataPosition,INDEX(Calculations!M$16:M$65,$F42,1),NA())","v":{"$error":"#N/A"}},{"$f":"IF($F42=myRawDataPosition,INDEX(Calculations!N$16:N$65,$F42,1),NA())","v":{"$error":"#N/A"}}]
[null,28,{"$f":"OFFSET(Data!E32,0,$D$6)","v":3951},3951.0000279999999,3951.0000279999999,28,{"$f":"INDEX(Data!B$5:B$54,$F43,1)","v":"Ngaliema (Mt. Stanley)"},{"$f":"INDEX(Data!C$5:C$54,$F43,1)","v":"Congo/Uganda"},{"$f":"INDEX(Data!F$5:F$54,$F43,1)","v":5109},{"$f":"INDEX(Data!G$5:G$54,$F43,1)","v":3951},{"$f":"INDEX(Data!H$5:H$54,$F43,1)","v":"Duke of the Abruzzi et al."},{"$f":"INDEX(Data!I$5:I$54,$F43,1)","v":"1906"},6.5,30,{"$f":"IF($F43=myRawDataPosition,INDEX(Calculations!M$16:M$65,$F43,1),NA())","v":{"$error":"#N/A"}},{"$f":"IF($F43=myRawDataPosition,INDEX(Calculations!N$16:N$65,$F43,1),NA())","v":{"$error":"#N/A"}}]
[null,29,{"$f":"OFFSET(Data!E33,0,$D$6)","v":3922},3922.0000289999998,3922.0000289999998,29,{"$f":"INDEX(Data!B$5:B$54,$F44,1)","v":"Kangchenjunga"},{"$f":"INDEX(Data!C$5:C$54,$F44,1)","v":"India/Nepal"},{"$f":"INDEX(Data!F$5:F$54,$F44,1)","v":8586},{"$f":"INDEX(Data!G$5:G$54,$F44,1)","v":3922},{"$f":"INDEX(Data!H$5:H$54,$F44,1)","v":"George Band, Joe Brown"},{"$f":"INDEX(Data!I$5:I$54,$F44,1)","v":"1955"},25,87.4,{"$f":"IF($F44=myRawDataPosition,INDEX(Calculations!M$16:M$65,$F44,1),NA())","v":{"$error":"#N/A"}},{"$f":"IF($F44=myRawDataPosition,INDEX(Calculations!N$16:N$65,$F44,1),NA())","v":{"$error":"#N/A"}}]
[null,30,{"$f":"OFFSET(Data!E34,0,$D$6)","v":3910},3910.0000300000002,3910.0000300000002,30,{"$f":"INDEX(Data!B$5:B$54,$F45,1)","v":"Tirich Mir"},{"$f":"INDEX(Data!C$5:C$54,$F45,1)","v":"Pakistan"},{"$f":"INDEX(Data!F$5:F$54,$F45,1)","v":7708},{"$f":"INDEX(Data!G$5:G$54,$F45,1)","v":3910},{"$f":"INDEX(Data!H$5:H$54,$F45,1)","v":"Arne Næss, P. Kvernberg, H. Berg, Tony Streather"},{"$f":"INDEX(Data!I$5:I$54,$F45,1)","v":"1950"},31.3,70.8,{"$f":"IF($F45=myRawDataPosition,INDEX(Calculations!M$16:M$65,$F45,1),NA())","v":{"$error":"#N/A"}},{"$f":"IF($F45=myRawDataPosition,INDEX(Calculations!N$16:N$65,$F45,1),NA())","v":{"$error":"#N/A"}}]
[null,31,{"$f":"OFFSET(Data!E35,0,$D$6)","v":3901},3901.000031,3901.000031,31,{"$f":"INDEX(Data!B$5:B$54,$F46,1)","v":"Mt. Cameroon"},{"$f":"INDEX(Data!C$5:C$54,$F46,1)","v":"Cameroon"},{"$f":"INDEX(Data!F$5:F$54,$F46,1)","v":4040},{"$f":"INDEX(Data!G$5:G$54,$F46,1)","v":3901},{"$f":"INDEX(Data!H$5:H$54,$F46,1)","v":"Richard Francis Burton, Gustav Mann"},{"$f":"INDEX(Data!I$5:I$54,$F46,1)","v":"1861"},8.9000000000000057,9.1765019999999993,{"$f":"IF($F46=myRawDataPosition,INDEX(Calculations!M$16:M$65,$F46,1),NA())","v":8.9000000000000057},{"$f":"IF($F46=myRawDataPosition,INDEX(Calculations!N$16:N$65,$F46,1),NA())","v":9.1765019999999993}]
[null,32,{"$f":"OFFSET(Data!E36,0,$D$6)","v":3825},3825.0000319999999,3825.0000319999999,32,{"$f":"INDEX(Data!B$5:B$54,$F47,1)","v":"Mt. Kenya"},{"$f":"INDEX(Data!C$5:C$54,$F47,1)","v":"Kenya"},{"$f":"INDEX(Data!F$5:F$54,$F47,1)","v":5199},{"$f":"INDEX(Data!G$5:G$54,$F47,1)","v":3825},{"$f":"INDEX(Data!H$5:H$54,$F47,1)","v":"Halford Mackinder, Cesar Ollier, Joseph Brocherel"},{"$f":"INDEX(Data!I$5:I$54,$F47,1)","v":"1899"},6.2,37.299999999999997,{"$f":"IF($F47=myRawDataPosition,INDEX(Calculations!M$16:M$65,$F47,1),NA())","v":{"$error":"#N/A"}},{"$f":"IF($F47=myRawDataPosition,INDEX(Calculations!N$16:N$65,$F47,1),NA())","v":{"$error":"#N/A"}}]
[null,33,{"$f":"OFFSET(Data!E37,0,$D$6)","v":3805},3805.0000329999998,3805.0000329999998,33,{"$f":"INDEX(Data!B$5:B$54,$F48,1)","v":"Gunung Kerinci"},{"$f":"INDEX(Data!C$5:C$54,$F48,1)","v":"Indonesia"},{"$f":"INDEX(Data!F$5:F$54,$F48,1)","v":3805},{"$f":"INDEX(Data!G$5:G$54,$F48,1)","v":3805},{"$f":"INDEX(Data!H$5:H$54,$F48,1)","v":"Hasselt, Veth"},{"$f":"INDEX(Data!I$5:I$54,$F48,1)","v":"1877"},5,100.6,{"$f":"IF($F48=myRawDataPosition,INDEX(Calculations!M$16:M$65,$F48,1),NA())","v":{"$error":"#N/A"}},{"$f":"IF($F48=myRawDataPosition,INDEX(Calculations!N$16:N$65,$F48,1),NA())","v":{"$error":"#N/A"}}]
[null,34,{"$f":"OFFSET(Data!E38,0,$D$6)","v":3794},3794.0000340000001,3794.0000340000001,34,{"$f":"INDEX(Data!B$5:B$54,$F49,1)","v":"Mt. Erebus"},{"$f":"INDEX(Data!C$5:C$54,$F49,1)","v":"Antarctica"},{"$f":"INDEX(Data!F$5:F$54,$F49,1)","v":3794},{"$f":"INDEX(Data!G$5:G$54,$F49,1)","v":3794},{"$f":"INDEX(Data!H$5:H$54,$F49,1)","v":"Tannatt David,Douglas Mawson"},{"$f":"INDEX(Data!I$5:I$54,$F49,1)","v":"1908"},-75.900000000000006,165.4,{"$f":"IF($F49=myRawDataPosition,INDEX(Calculations!M$16:M$65,$F49,1),NA())","v":{"$error":"#N/A"}},{"$f":"IF($F49=myRawDataPosition,INDEX(Calculations!N$16:N$65,$F49,1),NA())","v":{"$error":"#N/A"}}]
[null,35,{"$f":"OFFSET(Data!E39,0,$D$6)","v":3776},3776.000035,3776.000035,35,{"$f":"INDEX(Data!B$5:B$54,$F50,1)","v":"Fuji San"},{"$f":"INDEX(Data!C$5:C$54,$F50,1)","v":"Japan"},{"$f":"INDEX(Data!F$5:F$54,$F50,1)","v":3776},{"$f":"INDEX(Data!G$5:G$54,$F50,1)","v":3776},{"$f":"INDEX(Data!H$5:H$54,$F50,1)","v":"Unknown monk"},{"$f":"INDEX(Data!I$5:I$54,$F50,1)","v":"663"},30.2,137.69999999999999,{"$f":"IF($F50=myRawDataPosition,INDEX(Calculations!M$16:M$65,$F50,1),NA())","v":{"$error":"#N/A"}},{"$f":"IF($F50=myRawDataPosition,INDEX(Calculations!N$16:N$65,$F50,1),NA())","v":{"$error":"#N/A"}}]
[null,36,{"$f":"OFFSET(Data!E40,0,$D$6)","v":3755},3755.0000359999999,3755.0000369999998,37,{"$f":"INDEX(Data!B$5:B$54,$F51,1)","v":"Jebel Toubkal"},{"$f":"INDEX(Data!C$5:C$54,$F51,1)","v":"Morocco"},{"$f":"INDEX(Data!F$5:F$54,$F51,1)","v":4167},{"$f":"INDEX(Data!G$5:G$54,$F51,1)","v":3755},{"$f":"INDEX(Data!H$5:H$54,$F51,1)","v":"Marquis de Segonzac, V. Berger, H. Dolbeau"},{"$f":"INDEX(Data!I$5:I$54,$F51,1)","v":"1923"},-25.1,168.1,{"$f":"IF($F51=myRawDataPosition,INDEX(Calculations!M$16:M$65,$F51,1),NA())","v":{"$error":"#N/A"}},{"$f":"IF($F51=myRawDataPosition,INDEX(Calculations!N$16:N$65,$F51,1),NA())","v":{"$error":"#N/A"}}]
[null,37,{"$f":"OFFSET(Data!E41,0,$D$6)","v":3755},3755.0000369999998,3755.0000359999999,36,{"$f":"INDEX(Data!B$5:B$54,$F52,1)","v":"Mt. Cook"},{"$f":"INDEX(Data!C$5:C$54,$F52,1)","v":"New Zealand"},{"$f":"INDEX(Data!F$5:F$54,$F52,1)","v":3755},{"$f":"INDEX(Data!G$5:G$54,$F52,1)","v":3755},{"$f":"INDEX(Data!H$5:H$54,$F52,1)","v":"Tom Fyfe, George Graham, Jack Clarke"},{"$f":"INDEX(Data!I$5:I$54,$F52,1)","v":"1894"},27.4,-7.5999999999999943,{"$f":"IF($F52=myRawDataPosition,INDEX(Calculations!M$16:M$65,$F52,1),NA())","v":{"$error":"#N/A"}},{"$f":"IF($F52=myRawDataPosition,INDEX(Calculations!N$16:N$65,$F52,1),NA())","v":{"$error":"#N/A"}}]
[null,38,{"$f":"OFFSET(Data!E42,0,$D$6)","v":3727},3727.0000380000001,3727.0000380000001,38,{"$f":"INDEX(Data!B$5:B$54,$F53,1)","v":"Cerro Chirripo"},{"$f":"INDEX(Data!C$5:C$54,$F53,1)","v":"Costa Rica"},{"$f":"INDEX(Data!F$5:F$54,$F53,1)","v":3820},{"$f":"INDEX(Data!G$5:G$54,$F53,1)","v":3727},{"$f":"INDEX(Data!H$5:H$54,$F53,1)","v":"-"},{"$f":"INDEX(Data!I$5:I$54,$F53,1)","v":"-"},12.5,-82.2,{"$f":"IF($F53=myRawDataPosition,INDEX(Calculations!M$16:M$65,$F53,1),NA())","v":{"$error":"#N/A"}},{"$f":"IF($F53=myRawDataPosition,INDEX(Calculations!N$16:N$65,$F53,1),NA())","v":{"$error":"#N/A"}}]
[null,39,{"$f":"OFFSET(Data!E43,0,$D$6)","v":3726},3726.000039,3726.000039,39,{"$f":"INDEX(Data!B$5:B$54,$F54,1)","v":"Gunung Rinjani"},{"$f":"INDEX(Data!C$5:C$54,$F54,1)","v":"Indonesia"},{"$f":"INDEX(Data!F$5:F$54,$F54,1)","v":3726},{"$f":"INDEX(Data!G$5:G$54,$F54,1)","v":3726},{"$f":"INDEX(Data!H$5:H$54,$F54,1)","v":"-"},{"$f":"INDEX(Data!I$5:I$54,$F54,1)","v":"-"},0.80000000000001137,115.5,{"$f":"IF($F54=myRawDataPosition,INDEX(Calculations!M$16:M$65,$F54,1),NA())","v":{"$error":"#N/A"}},{"$f":"IF($F54=myRawDataPosition,INDEX(Calculations!N$16:N$65,$F54,1),NA())","v":{"$error":"#N/A"}}]
[null,40,{"$f":"OFFSET(Data!E44,0,$D$6)","v":3718},3718.0000399999999,3718.0000399999999,40,{"$f":"INDEX(Data!B$5:B$54,$F55,1)","v":"Pico Teide"},{"$f":"INDEX(Data!C$5:C$54,$F55,1)","v":"Spain"},{"$f":"INDEX(Data!F$5:F$54,$F55,1)","v":3718},{"$f":"INDEX(Data!G$5:G$54,$F55,1)","v":3718},{"$f":"INDEX(Data!H$5:H$54,$F55,1)","v":"Sir Edmund Scory"},{"$f":"INDEX(Data!I$5:I$54,$F55,1)","v":"1582"},25.2,-16.3,{"$f":"IF($F55=myRawDataPosition,INDEX(Calculations!M$16:M$65,$F55,1),NA())","v":{"$error":"#N/A"}},{"$f":"IF($F55=myRawDataPosition,INDEX(Calculations!N$16:N$65,$F55,1),NA())","v":{"$error":"#N/A"}}]
[null,41,{"$f":"OFFSET(Data!E45,0,$D$6)","v":3696},3696.0000409999998,3696.0000409999998,41,{"$f":"INDEX(Data!B$5:B$54,$F56,1)","v":"Monte San Valentin"},{"$f":"INDEX(Data!C$5:C$54,$F56,1)","v":"Chile"},{"$f":"INDEX(Data!F$5:F$54,$F56,1)","v":4058},{"$f":"INDEX(Data!G$5:G$54,$F56,1)","v":3696},{"$f":"INDEX(Data!H$5:H$54,$F56,1)","v":"-"},{"$f":"INDEX(Data!I$5:I$54,$F56,1)","v":"-"},-28.1,-72.2,{"$f":"IF($F56=myRawDataPosition,INDEX(Calculations!M$16:M$65,$F56,1),NA())","v":{"$error":"#N/A"}},{"$f":"IF($F56=myRawDataPosition,INDEX(Calculations!N$16:N$65,$F56,1),NA())","v":{"$error":"#N/A"}}]
[null,42,{"$f":"OFFSET(Data!E46,0,$D$6)","v":3694},3694.0000420000001,3694.0000420000001,42,{"$f":"INDEX(Data!B$5:B$54,$F57,1)","v":"Gunnbjørnsfjeld"},{"$f":"INDEX(Data!C$5:C$54,$F57,1)","v":"Greenland"},{"$f":"INDEX(Data!F$5:F$54,$F57,1)","v":3694},{"$f":"INDEX(Data!G$5:G$54,$F57,1)","v":3694},{"$f":"INDEX(Data!H$5:H$54,$F57,1)","v":"Augustine Cortauld, Jack Longland, Ebbe Munck, H.G. Wager, Laurence Wager"},{"$f":"INDEX(Data!I$5:I$54,$F57,1)","v":"1935"},68.5,-29.1,{"$f":"IF($F57=myRawDataPosition,INDEX(Calculations!M$16:M$65,$F57,1),NA())","v":{"$error":"#N/A"}},{"$f":"IF($F57=myRawDataPosition,INDEX(Calculations!N$16:N$65,$F57,1),NA())","v":{"$error":"#N/A"}}]
[null,43,{"$f":"OFFSET(Data!E47,0,$D$6)","v":3688},3688.000043,3688.000043,43,{"$f":"INDEX(Data!B$5:B$54,$F58,1)","v":"Nevado Ojos del Salado"},{"$f":"INDEX(Data!C$5:C$54,$F58,1)","v":"Argentina/Chile"},{"$f":"INDEX(Data!F$5:F$54,$F58,1)","v":6893},{"$f":"INDEX(Data!G$5:G$54,$F58,1)","v":3688},{"$f":"INDEX(Data!H$5:H$54,$F58,1)","v":"Justyn Wojsznis, Jan Szczepanski"},{"$f":"INDEX(Data!I$5:I$54,$F58,1)","v":"1937"},-12.1,-67.8,{"$f":"IF($F58=myRawDataPosition,INDEX(Calculations!M$16:M$65,$F58,1),NA())","v":{"$error":"#N/A"}},{"$f":"IF($F58=myRawDataPosition,INDEX(Calculations!N$16:N$65,$F58,1),NA())","v":{"$error":"#N/A"}}]
[null,44,{"$f":"OFFSET(Data!E48,0,$D$6)","v":3676},3676.0000439999999,3676.0000439999999,44,{"$f":"INDEX(Data!B$5:B$54,$F59,1)","v":"Gunung Semeru"},{"$f":"INDEX(Data!C$5:C$54,$F59,1)","v":"Indonesia"},{"$f":"INDEX(Data!F$5:F$54,$F59,1)","v":3676},{"$f":"INDEX(Data!G$5:G$54,$F59,1)","v":3676},{"$f":"INDEX(Data!H$5:H$54,$F59,1)","v":"-"},{"$f":"INDEX(Data!I$5:I$54,$F59,1)","v":"-"},0.90000000000000568,112.3,{"$f":"IF($F59=myRawDataPosition,INDEX(Calculations!M$16:M$65,$F59,1),NA())","v":{"$error":"#N/A"}},{"$f":"IF($F59=myRawDataPosition,INDEX(Calculations!N$16:N$65,$F59,1),NA())","v":{"$error":"#N/A"}}]
[null,45,{"$f":"OFFSET(Data!E49,0,$D$6)","v":3675},3675.0000449999998,3675.0000449999998,45,{"$f":"INDEX(Data!B$5:B$54,$F60,1)","v":"Finisterre Range HP"},{"$f":"INDEX(Data!C$5:C$54,$F60,1)","v":"Papua New Guinea"},{"$f":"INDEX(Data!F$5:F$54,$F60,1)","v":4125},{"$f":"INDEX(Data!G$5:G$54,$F60,1)","v":3675},{"$f":"INDEX(Data!H$5:H$54,$F60,1)","v":"Hugo Zöller"},{"$f":"INDEX(Data!I$5:I$54,$F60,1)","v":"1889"},2.3000000000000114,145.5,{"$f":"IF($F60=myRawDataPosition,INDEX(Calculations!M$16:M$65,$F60,1),NA())","v":{"$error":"#N/A"}},{"$f":"IF($F60=myRawDataPosition,INDEX(Calculations!N$16:N$65,$F60,1),NA())","v":{"$error":"#N/A"}}]
[null,46,{"$f":"OFFSET(Data!E50,0,$D$6)","v":3645},3645.0000460000001,3645.0000460000001,46,{"$f":"INDEX(Data!B$5:B$54,$F61,1)","v":"Ritacuba Blanco"},{"$f":"INDEX(Data!C$5:C$54,$F61,1)","v":"Colombia"},{"$f":"INDEX(Data!F$5:F$54,$F61,1)","v":5410},{"$f":"INDEX(Data!G$5:G$54,$F61,1)","v":3645},{"$f":"INDEX(Data!H$5:H$54,$F61,1)","v":"-"},{"$f":"INDEX(Data!I$5:I$54,$F61,1)","v":"-"},10.5,-71.099999999999994,{"$f":"IF($F61=myRawDataPosition,INDEX(Calculations!M$16:M$65,$F61,1),NA())","v":{"$error":"#N/A"}},{"$f":"IF($F61=myRawDataPosition,INDEX(Calculations!N$16:N$65,$F61,1),NA())","v":{"$error":"#N/A"}}]
[null,47,{"$f":"OFFSET(Data!E51,0,$D$6)","v":3642},3642.000047,3642.000047,47,{"$f":"INDEX(Data!B$5:B$54,$F62,1)","v":"Minya Konka"},{"$f":"INDEX(Data!C$5:C$54,$F62,1)","v":"China"},{"$f":"INDEX(Data!F$5:F$54,$F62,1)","v":7556},{"$f":"INDEX(Data!G$5:G$54,$F62,1)","v":3642},{"$f":"INDEX(Data!H$5:H$54,$F62,1)","v":"US american explorer team"},{"$f":"INDEX(Data!I$5:I$54,$F62,1)","v":"1932"},26.3,100.9,{"$f":"IF($F62=myRawDataPosition,INDEX(Calculations!M$16:M$65,$F62,1),NA())","v":{"$error":"#N/A"}},{"$f":"IF($F62=myRawDataPosition,INDEX(Calculations!N$16:N$65,$F62,1),NA())","v":{"$error":"#N/A"}}]
[null,48,{"$f":"OFFSET(Data!E52,0,$D$6)","v":3611},3611.0000479999999,3611.0000479999999,48,{"$f":"INDEX(Data!B$5:B$54,$F63,1)","v":"Mt. Ararat (Agri Dagi)"},{"$f":"INDEX(Data!C$5:C$54,$F63,1)","v":"Turkey"},{"$f":"INDEX(Data!F$5:F$54,$F63,1)","v":5137},{"$f":"INDEX(Data!G$5:G$54,$F63,1)","v":3611},{"$f":"INDEX(Data!H$5:H$54,$F63,1)","v":"J. J. Friedrich Parrot jun."},{"$f":"INDEX(Data!I$5:I$54,$F63,1)","v":"1829"},34.1,43.8,{"$f":"IF($F63=myRawDataPosition,INDEX(Calculations!M$16:M$65,$F63,1),NA())","v":{"$error":"#N/A"}},{"$f":"IF($F63=myRawDataPosition,INDEX(Calculations!N$16:N$65,$F63,1),NA())","v":{"$error":"#N/A"}}]
[null,49,{"$f":"OFFSET(Data!E53,0,$D$6)","v":3585},3585.0000490000002,3585.0000490000002,49,{"$f":"INDEX(Data!B$5:B$54,$F64,1)","v":"Kongur Shan"},{"$f":"INDEX(Data!C$5:C$54,$F64,1)","v":"China"},{"$f":"INDEX(Data!F$5:F$54,$F64,1)","v":7649},{"$f":"INDEX(Data!G$5:G$54,$F64,1)","v":3585},{"$f":"INDEX(Data!H$5:H$54,$F64,1)","v":"Chris Bonington, Al Rouse, Peter Boardman, Joe Tasker"},{"$f":"INDEX(Data!I$5:I$54,$F64,1)","v":"1981"},33.4,74.5,{"$f":"IF($F64=myRawDataPosition,INDEX(Calculations!M$16:M$65,$F64,1),NA())","v":{"$error":"#N/A"}},{"$f":"IF($F64=myRawDataPosition,INDEX(Calculations!N$16:N$65,$F64,1),NA())","v":{"$error":"#N/A"}}]
[null,50,{"$f":"OFFSET(Data!E54,0,$D$6)","v":3535},3535.0000500000001,3535.0000500000001,50,{"$f":"INDEX(Data!B$5:B$54,$F65,1)","v":"Mt. Blackburn"},{"$f":"INDEX(Data!C$5:C$54,$F65,1)","v":"US"},{"$f":"INDEX(Data!F$5:F$54,$F65,1)","v":4996},{"$f":"INDEX(Data!G$5:G$54,$F65,1)","v":3535},{"$f":"INDEX(Data!H$5:H$54,$F65,1)","v":"Bruce Gilbert, Dick Wahlstrom, Hans Gmoser, Adolf Bitterlich, Leon Blumer"},{"$f":"INDEX(Data!I$5:I$54,$F65,1)","v":"1958"},57.3,-141.5,{"$f":"IF($F65=myRawDataPosition,INDEX(Calculations!M$16:M$65,$F65,1),NA())","v":{"$error":"#N/A"}},{"$f":"IF($F65=myRawDataPosition,INDEX(Calculations!N$16:N$65,$F65,1),NA())","v":{"$error":"#N/A"}}]
[]
[null,"Dashboard Snapshot"]
[]
[null,null,null,null,"No.","Position","Summit Name","Country","Elevation in m","Prominence in m","First Ascent by","Year","Highlight Elevation","Highlight Prominence","Max Elevation","Max Prominence"]
[null,null,null,null,{"$f":"OFFSET(B15,$D$8,0)","v":27},{"$f":"OFFSET(F15,$D$8,0)","v":27},{"$f":"OFFSET(G15,$D$8,0)","v":"Yu Shan"},"Taiwan",{"$f":"OFFSET(I15,$D$8,0)","v":3952},3952,"K. Stopel","1898",{"$f":"IF($F70=myRawDataPosition,I70,NA())","v":{"$error":"#N/A"}},{"$f":"IF($F70=myRawDataPosition,J70,NA())","v":{"$error":"#N/A"}},{"$f":"MAX(I16:I65)","v":8848},{"$f":"MAX(J16:J65)","v":8848}]
[null,null,null,null,28,28,"Ngaliema (Mt. Stanley)","Congo/Uganda",5109,3951,"Duke of the Abruzzi et al.","1906",{"$error":"#N/A"},{"$error":"#N/A"}]
[null,null,null,null,29,29,"Kangchenjunga","India/Nepal",8586,3922,"George Band, Joe Brown","1955",{"$error":"#N/A"},{"$error":"#N/A"}]
[null,null,null,null,30,30,"Tirich Mir","Pakistan",7708,3910,"Arne Næss, P. Kvernberg, H. Berg, Tony Streather","1950",{"$error":"#N/A"},{"$error":"#N/A"}]
[null,null,null,null,31,31,"Mt. Cameroon","Cameroon",4040,3901,"Richard Francis Burton, Gustav Mann","1861",4040,3901]
[null,null,null,null,32,32,"Mt. Kenya","Kenya",5199,3825,"Halford Mackinder, Cesar Ollier, Joseph Brocherel","1899",{"$error":"#N/A"},{"$error":"#N/A"}]
[null,null,null,null,33,33,"Gunung Kerinci","Indonesia",3805,3805,"Hasselt, Veth","1877",{"$error":"#N/A"},{"$error":"#N/A"}]
[null,null,null,null,34,34,"Mt. Erebus","Antarctica",3794,3794,"Tannatt David,Douglas Mawson","1908",{"$error":"#N/A"},{"$error":"#N/A"}]
[null,null,null,null,35,35,"Fuji San","Japan",3776,3776,"Unknown monk","663",{"$error":"#N/A"},{"$error":"#N/A"}]
[null,null,null,null,36,37,"Jebel Toubkal","Morocco",4167,3755,"Marquis de Segonzac, V. Berger, H. Dolbeau","1923",{"$error":"#N/A"},{"$error":"#N/A"}]
[]
[]
[null,"Camera Tooltip"]
[]
[]
[null,null,null,null,null,"Hovered Summit",39]
[]
[null,null,null,null,null,"Summit:",{"$f":"INDEX(Data!$B$5:$B$54,$G$85,1)&\" (\"&INDEX(Data!$C$5:$C$54,myHoveredSummit,1)&\")\"","v":"Gunung Rinjani (Indonesia)"}]
[null,null,null,null,null,"Elevation:",{"$f":"INDEX(Data!$F$5:$F$54,$G$85,1)&\" m\"","v":"3726 m"}]
[null,null,null,null,null,"Prominence:",{"$f":"INDEX(Data!$G$5:$G$54,$G$85,1)&\" m\"","v":"3726 m"}]
[null,null,null,null,null,"First ascent by:",{"$f":"INDEX(Data!$H$5:$H$54,$G$85,1)","v":"-"}]
[null,null,null,null,null,"Year:",{"$f":"INDEX(Data!$I$5:$I$54,$G$85,1)","v":"-"}]